BDBM50372434 CHEMBL271767
SMILES: ONC(=O)c1cc2cc(ccc2s1)C(=O)Nc1ccccc1
InChI Key: InChIKey=AYICHPSZNZPZJW-UHFFFAOYSA-N
Data: 1 IC50
Activity Spreadsheet -- Enzyme Inhibition Constant Data from BindingDB
Found 1 hit for monomerid = 50372434
Trg + Lig
Ki
nM
ΔG°
kcal/mole
IC50
nM
Kd
nM
EC50/IC50
nM
koff
s-1
kon
M-1s-1
pHTemp
°C
Histone deacetylase 1
(Homo sapiens (Human))
BDBM50372434
(CHEMBL271767)
Show SMILES ONC(=O)c1cc2cc(ccc2s1)C(=O)Nc1ccccc1
Show InChI InChI=1S/C16H12N2O3S/c19-15(17-12-4-2-1-3-5-12)10-6-7-13-11(8-10)9-14(22-13)16(20)18-21/h1-9,21H,(H,17,19)(H,18,20)
NCI pathway
Reactome pathway
n/an/a 582n/an/an/an/an/an/a
Menarini Ricerche
Curated by ChEMBL
Assay Description
Inhibition of human HDAC1
J Med Chem 51: 1505-29 (2008)
Article DOI: 10.1021/jm7011408
BindingDB Entry DOI: 10.7270/Q2M32WMT