null
SMILES: CC(C)(C)NCc1c(nc2cc(\C=C\C(=O)NO)ccn12)-c1ccccc1
InChI Key: InChIKey=SPJNUOFOQIVWAF-MDZDMXLPSA-N
Activity Spreadsheet -- Enzyme Inhibition Constant Data from BindingDB
Found 2 hits for monomerid = 50372457
Trg + Lig
Ki
nM
ΔG°
kcal/mole
IC50
nM
Kd
nM
EC50/IC50
nM
koff
s-1
kon
M-1s-1
pHTemp
°C
Histone deacetylase 1
(Homo sapiens (Human))
BDBM50372457
(CHEMBL260959 | US8648092, 45)
Show SMILES CC(C)(C)NCc1c(nc2cc(\C=C\C(=O)NO)ccn12)-c1ccccc1
Show InChI InChI=1S/C21H24N4O2/c1-21(2,3)22-14-17-20(16-7-5-4-6-8-16)23-18-13-15(11-12-25(17)18)9-10-19(26)24-27/h4-13,22,27H,14H2,1-3H3,(H,24,26)/b10-9+
NCI pathway
Reactome pathway
n/an/a 45n/an/an/an/an/an/a
Menarini Ricerche
Curated by ChEMBL
Assay Description
Inhibition of HDAC1
J Med Chem 51: 1505-29 (2008)
Article DOI: 10.1021/jm7011408
BindingDB Entry DOI: 10.7270/Q2M32WMT
Histone deacetylase 1
(Homo sapiens (Human))
BDBM50372457
(CHEMBL260959 | US8648092, 45)
Show SMILES CC(C)(C)NCc1c(nc2cc(\C=C\C(=O)NO)ccn12)-c1ccccc1
Show InChI InChI=1S/C21H24N4O2/c1-21(2,3)22-14-17-20(16-7-5-4-6-8-16)23-18-13-15(11-12-25(17)18)9-10-19(26)24-27/h4-13,22,27H,14H2,1-3H3,(H,24,26)/b10-9+
NCI pathway
Reactome pathway
US Patent
n/an/a 45n/an/an/an/a7.525
MEI Pharma
US Patent
Assay Description
The assay has been carried out in 96 well format and the BIOMOL fluorescent-based HDAC activity assay has been applied. The reaction composed of assa...
US Patent US8648092 (2014)
BindingDB Entry DOI: 10.7270/Q2HD7TBG