BDBM50372751 CHEMBL256222
SMILES: O=C(Nc1ccc(Oc2ccccc2)cc1)C1C(=O)CC(Cc2ccccc2)NC1=O
InChI Key: InChIKey=BOOKXOVMQLQATB-UHFFFAOYSA-N
Data: 2 IC50
Activity Spreadsheet -- Enzyme Inhibition Constant Data from BindingDB
Found 2 hits for monomerid = 50372751
Trg + Lig
Ki
nM
ΔG°
kcal/mole
IC50
nM
Kd
nM
EC50/IC50
nM
koff
s-1
kon
M-1s-1
pHTemp
°C
Undecaprenyl pyrophosphate synthase
(Streptococcus pneumoniae)
BDBM50372751
(CHEMBL256222)
Show SMILES O=C(Nc1ccc(Oc2ccccc2)cc1)C1C(=O)CC(Cc2ccccc2)NC1=O
Show InChI InChI=1S/C25H22N2O4/c28-22-16-19(15-17-7-3-1-4-8-17)27-25(30)23(22)24(29)26-18-11-13-21(14-12-18)31-20-9-5-2-6-10-20/h1-14,19,23H,15-16H2,(H,26,29)(H,27,30)
n/an/a 110n/an/an/an/an/an/a
Novartis Institutes for BioMedical Research
Curated by ChEMBL
Assay Description
Inhibition of Streptococcus pneumoniae UPPS
Bioorg Med Chem Lett 18: 1840-4 (2008)
Article DOI: 10.1016/j.bmcl.2008.02.009
BindingDB Entry DOI: 10.7270/Q2CF9QZ5
Farnesyl diphosphate synthase
(Homo sapiens (Human))
BDBM50372751
(CHEMBL256222)
Show SMILES O=C(Nc1ccc(Oc2ccccc2)cc1)C1C(=O)CC(Cc2ccccc2)NC1=O
Show InChI InChI=1S/C25H22N2O4/c28-22-16-19(15-17-7-3-1-4-8-17)27-25(30)23(22)24(29)26-18-11-13-21(14-12-18)31-20-9-5-2-6-10-20/h1-14,19,23H,15-16H2,(H,26,29)(H,27,30)
Reactome pathway
n/an/a>5.00E+4n/an/an/an/an/an/a
Novartis Institutes for BioMedical Research
Curated by ChEMBL
Assay Description
Inhibition of human FPPS
Bioorg Med Chem Lett 18: 1840-4 (2008)
Article DOI: 10.1016/j.bmcl.2008.02.009
BindingDB Entry DOI: 10.7270/Q2CF9QZ5