BDBM50372759 CHEMBL256476
SMILES: O=C(Nc1ccc(cc1)N1CCCCC1)C1C(=O)NC(CCc2ccccc2)C1=O
InChI Key: InChIKey=LGNMJXRHUNBAQU-UHFFFAOYSA-N
Data: 2 IC50
Activity Spreadsheet -- Enzyme Inhibition Constant Data from BindingDB
Found 2 hits for monomerid = 50372759
Trg + Lig
Ki
nM
ΔG°
kcal/mole
IC50
nM
Kd
nM
EC50/IC50
nM
koff
s-1
kon
M-1s-1
pHTemp
°C
Undecaprenyl pyrophosphate synthase
(Streptococcus pneumoniae)
BDBM50372759
(CHEMBL256476)
Show SMILES O=C(Nc1ccc(cc1)N1CCCCC1)C1C(=O)NC(CCc2ccccc2)C1=O
Show InChI InChI=1S/C24H27N3O3/c28-22-20(14-9-17-7-3-1-4-8-17)26-24(30)21(22)23(29)25-18-10-12-19(13-11-18)27-15-5-2-6-16-27/h1,3-4,7-8,10-13,20-21H,2,5-6,9,14-16H2,(H,25,29)(H,26,30)
n/an/a 800n/an/an/an/an/an/a
Novartis Institutes for BioMedical Research
Curated by ChEMBL
Assay Description
Inhibition of Streptococcus pneumoniae UPPS
Bioorg Med Chem Lett 18: 1840-4 (2008)
Article DOI: 10.1016/j.bmcl.2008.02.009
BindingDB Entry DOI: 10.7270/Q2CF9QZ5
Farnesyl diphosphate synthase
(Homo sapiens (Human))
BDBM50372759
(CHEMBL256476)
Show SMILES O=C(Nc1ccc(cc1)N1CCCCC1)C1C(=O)NC(CCc2ccccc2)C1=O
Show InChI InChI=1S/C24H27N3O3/c28-22-20(14-9-17-7-3-1-4-8-17)26-24(30)21(22)23(29)25-18-10-12-19(13-11-18)27-15-5-2-6-16-27/h1,3-4,7-8,10-13,20-21H,2,5-6,9,14-16H2,(H,25,29)(H,26,30)
Reactome pathway
n/an/a>5.00E+4n/an/an/an/an/an/a
Novartis Institutes for BioMedical Research
Curated by ChEMBL
Assay Description
Inhibition of human FPPS
Bioorg Med Chem Lett 18: 1840-4 (2008)
Article DOI: 10.1016/j.bmcl.2008.02.009
BindingDB Entry DOI: 10.7270/Q2CF9QZ5