BDBM50372761 CHEMBL272163
SMILES: CC(C)CC1NC(=O)C(C(=O)Nc2ccc(cc2)C2CCCCC2)C1=O
InChI Key: InChIKey=IZDXXXQMBXLHDT-UHFFFAOYSA-N
Data: 2 IC50
Activity Spreadsheet -- Enzyme Inhibition Constant Data from BindingDB
Found 2 hits for monomerid = 50372761
Trg + Lig
Ki
nM
ΔG°
kcal/mole
IC50
nM
Kd
nM
EC50/IC50
nM
koff
s-1
kon
M-1s-1
pHTemp
°C
Undecaprenyl pyrophosphate synthase
(Streptococcus pneumoniae)
BDBM50372761
(CHEMBL272163)
Show SMILES CC(C)CC1NC(=O)C(C(=O)Nc2ccc(cc2)C2CCCCC2)C1=O
Show InChI InChI=1S/C21H28N2O3/c1-13(2)12-17-19(24)18(21(26)23-17)20(25)22-16-10-8-15(9-11-16)14-6-4-3-5-7-14/h8-11,13-14,17-18H,3-7,12H2,1-2H3,(H,22,25)(H,23,26)
n/an/a 1.30E+3n/an/an/an/an/an/a
Novartis Institutes for BioMedical Research
Curated by ChEMBL
Assay Description
Inhibition of Streptococcus pneumoniae UPPS
Bioorg Med Chem Lett 18: 1840-4 (2008)
Article DOI: 10.1016/j.bmcl.2008.02.009
BindingDB Entry DOI: 10.7270/Q2CF9QZ5
Farnesyl diphosphate synthase
(Homo sapiens (Human))
BDBM50372761
(CHEMBL272163)
Show SMILES CC(C)CC1NC(=O)C(C(=O)Nc2ccc(cc2)C2CCCCC2)C1=O
Show InChI InChI=1S/C21H28N2O3/c1-13(2)12-17-19(24)18(21(26)23-17)20(25)22-16-10-8-15(9-11-16)14-6-4-3-5-7-14/h8-11,13-14,17-18H,3-7,12H2,1-2H3,(H,22,25)(H,23,26)
Reactome pathway
n/an/a>5.00E+4n/an/an/an/an/an/a
Novartis Institutes for BioMedical Research
Curated by ChEMBL
Assay Description
Inhibition of human FPPS
Bioorg Med Chem Lett 18: 1840-4 (2008)
Article DOI: 10.1016/j.bmcl.2008.02.009
BindingDB Entry DOI: 10.7270/Q2CF9QZ5