BDBM50372841 CHEMBL429604
SMILES: CC(C)c1cc(NC(=O)NCCCN2CCC[C@@H](Cc3ccc(F)cc3)C2)cc(c1)-c1nnnn1C
InChI Key: InChIKey=JHSQADBOQIOZCJ-NRFANRHFSA-N
Data: 3 IC50
Activity Spreadsheet -- Enzyme Inhibition Constant Data from BindingDB
Found 3 hits for monomerid = 50372841
Trg + Lig
Ki
nM
ΔG°
kcal/mole
IC50
nM
Kd
nM
EC50/IC50
nM
koff
s-1
kon
M-1s-1
pHTemp
°C
C-C chemokine receptor type 3
(Homo sapiens (Human))
BDBM50372841
(CHEMBL429604)
Show SMILES CC(C)c1cc(NC(=O)NCCCN2CCC[C@@H](Cc3ccc(F)cc3)C2)cc(c1)-c1nnnn1C
Show InChI InChI=1S/C27H36FN7O/c1-19(2)22-15-23(26-31-32-33-34(26)3)17-25(16-22)30-27(36)29-11-5-13-35-12-4-6-21(18-35)14-20-7-9-24(28)10-8-20/h7-10,15-17,19,21H,4-6,11-14,18H2,1-3H3,(H2,29,30,36)/t21-/m0/s1
Reactome pathway
n/an/a 0.300n/an/an/an/an/an/a
Bristol-Myers Squibb Company
Curated by ChEMBL
Assay Description
Antagonist activity at human CCR3 receptor in human eosinophil assessed as inhibition of eotaxin-induced chemotaxis
Bioorg Med Chem Lett 18: 576-85 (2008)
Article DOI: 10.1016/j.bmcl.2007.11.067
BindingDB Entry DOI: 10.7270/Q2057GS3
Cytochrome P450 2D6
(Homo sapiens (Human))
BDBM50372841
(CHEMBL429604)
Show SMILES CC(C)c1cc(NC(=O)NCCCN2CCC[C@@H](Cc3ccc(F)cc3)C2)cc(c1)-c1nnnn1C
Show InChI InChI=1S/C27H36FN7O/c1-19(2)22-15-23(26-31-32-33-34(26)3)17-25(16-22)30-27(36)29-11-5-13-35-12-4-6-21(18-35)14-20-7-9-24(28)10-8-20/h7-10,15-17,19,21H,4-6,11-14,18H2,1-3H3,(H2,29,30,36)/t21-/m0/s1
n/an/a 4.60E+3n/an/an/an/an/an/a
Bristol-Myers Squibb Company
Curated by ChEMBL
Assay Description
Inhibition of CYP2D6
Bioorg Med Chem Lett 18: 576-85 (2008)
Article DOI: 10.1016/j.bmcl.2007.11.067
BindingDB Entry DOI: 10.7270/Q2057GS3
C-C chemokine receptor type 3
(Homo sapiens (Human))
BDBM50372841
(CHEMBL429604)
Show SMILES CC(C)c1cc(NC(=O)NCCCN2CCC[C@@H](Cc3ccc(F)cc3)C2)cc(c1)-c1nnnn1C
Show InChI InChI=1S/C27H36FN7O/c1-19(2)22-15-23(26-31-32-33-34(26)3)17-25(16-22)30-27(36)29-11-5-13-35-12-4-6-21(18-35)14-20-7-9-24(28)10-8-20/h7-10,15-17,19,21H,4-6,11-14,18H2,1-3H3,(H2,29,30,36)/t21-/m0/s1
Reactome pathway
n/an/a 2.60n/an/an/an/an/an/a
Bristol-Myers Squibb Company
Curated by ChEMBL
Assay Description
Displacement of [125I]eotaxin from human CCR3 receptor expressed in CHO cells
Bioorg Med Chem Lett 18: 576-85 (2008)
Article DOI: 10.1016/j.bmcl.2007.11.067
BindingDB Entry DOI: 10.7270/Q2057GS3