BDBM50372867 CHEMBL404080
SMILES: Fc1ccccc1C#Cc1ccc2N=C(CC(=O)Nc2c1)c1cccc(c1)-n1ccnc1
InChI Key: InChIKey=YEAILLALDWAZBC-UHFFFAOYSA-N
Data: 2 IC50
Activity Spreadsheet -- Enzyme Inhibition Constant Data from BindingDB
Found 2 hits for monomerid = 50372867
Trg + Lig
Ki
nM
ΔG°
kcal/mole
IC50
nM
Kd
nM
EC50/IC50
nM
koff
s-1
kon
M-1s-1
pHTemp
°C
Metabotropic glutamate receptor 2
(Homo sapiens (Human))
BDBM50372867
(CHEMBL404080)
Show SMILES Fc1ccccc1C#Cc1ccc2N=C(CC(=O)Nc2c1)c1cccc(c1)-n1ccnc1 |c:14|
Show InChI InChI=1S/C26H17FN4O/c27-22-7-2-1-4-19(22)10-8-18-9-11-23-25(14-18)30-26(32)16-24(29-23)20-5-3-6-21(15-20)31-13-12-28-17-31/h1-7,9,11-15,17H,16H2,(H,30,32)
n/an/a 16n/an/an/an/an/an/a
F. Hoffmann-La Roche Ltd
Curated by ChEMBL
Assay Description
Antagonist activity at rat mGluR2 assessed as effect on (1S,3R)-ACPD-induced inhibition of forskolin-stimulated cAMP production
Bioorg Med Chem Lett 18: 1091-5 (2008)
Article DOI: 10.1016/j.bmcl.2007.12.005
BindingDB Entry DOI: 10.7270/Q2VD7096
Metabotropic glutamate receptor 2
(Homo sapiens (Human))
BDBM50372867
(CHEMBL404080)
Show SMILES Fc1ccccc1C#Cc1ccc2N=C(CC(=O)Nc2c1)c1cccc(c1)-n1ccnc1 |c:14|
Show InChI InChI=1S/C26H17FN4O/c27-22-7-2-1-4-19(22)10-8-18-9-11-23-25(14-18)30-26(32)16-24(29-23)20-5-3-6-21(15-20)31-13-12-28-17-31/h1-7,9,11-15,17H,16H2,(H,30,32)
n/an/a 20n/an/an/an/an/an/a
F. Hoffmann-La Roche Ltd
Curated by ChEMBL
Assay Description
Displacement of [3H]LY354740 from rat recombinant mGluR2 expressed in CHO cells
Bioorg Med Chem Lett 18: 1091-5 (2008)
Article DOI: 10.1016/j.bmcl.2007.12.005
BindingDB Entry DOI: 10.7270/Q2VD7096