BDBM50372985 CHEMBL272965
SMILES: Cn1ncc(-c2ccsc2)c(-c2ccc(C[C@H](NC(=O)c3c(Cl)cccc3Cl)C(O)=O)cc2)c1=O
InChI Key: InChIKey=VDAVCTZCHJAJJR-FQEVSTJZSA-N
Data: 2 IC50
Activity Spreadsheet -- Enzyme Inhibition Constant Data from BindingDB
Found 2 hits for monomerid = 50372985
Trg + Lig
Ki
nM
ΔG°
kcal/mole
IC50
nM
Kd
nM
EC50/IC50
nM
koff
s-1
kon
M-1s-1
pHTemp
°C
Fibronectin receptor beta/Integrin alpha-4
(Homo sapiens (Human))
BDBM50372985
(CHEMBL272965)
Show SMILES Cn1ncc(-c2ccsc2)c(-c2ccc(C[C@H](NC(=O)c3c(Cl)cccc3Cl)C(O)=O)cc2)c1=O
Show InChI InChI=1S/C25H19Cl2N3O4S/c1-30-24(32)21(17(12-28-30)16-9-10-35-13-16)15-7-5-14(6-8-15)11-20(25(33)34)29-23(31)22-18(26)3-2-4-19(22)27/h2-10,12-13,20H,11H2,1H3,(H,29,31)(H,33,34)/t20-/m0/s1
Reactome pathway
n/an/a 830n/an/an/an/an/an/a
Johnson& Johnson Pharmaceutical Research& Development
Curated by ChEMBL
Assay Description
Inhibition of human integrin alpha-4-beta-1-mediated Ramos cell adhesion to immobilized VCAM1
Bioorg Med Chem Lett 18: 1331-5 (2008)
Article DOI: 10.1016/j.bmcl.2008.01.022
BindingDB Entry DOI: 10.7270/Q2TD9Z6W
Integrin α4β7
(Homo sapiens (Human))
BDBM50372985
(CHEMBL272965)
Show SMILES Cn1ncc(-c2ccsc2)c(-c2ccc(C[C@H](NC(=O)c3c(Cl)cccc3Cl)C(O)=O)cc2)c1=O
Show InChI InChI=1S/C25H19Cl2N3O4S/c1-30-24(32)21(17(12-28-30)16-9-10-35-13-16)15-7-5-14(6-8-15)11-20(25(33)34)29-23(31)22-18(26)3-2-4-19(22)27/h2-10,12-13,20H,11H2,1H3,(H,29,31)(H,33,34)/t20-/m0/s1
NCI pathway
Reactome pathway
n/an/a 69n/an/an/an/an/an/a
Johnson& Johnson Pharmaceutical Research& Development
Curated by ChEMBL
Assay Description
Inhibition of human integrin alpha-4-beta-7-mediated K562 cell adhesion to immobilized MAdCAM1
Bioorg Med Chem Lett 18: 1331-5 (2008)
Article DOI: 10.1016/j.bmcl.2008.01.022
BindingDB Entry DOI: 10.7270/Q2TD9Z6W