BDBM50373004 CHEMBL258134
SMILES: Cn1ncc(-c2ccc(F)cc2)c(-c2ccc(C[C@H](NC(=O)c3c(Cl)cccc3Cl)C(O)=O)cc2)c1=O
InChI Key: InChIKey=YZOVQSYKZPZDRM-QFIPXVFZSA-N
Data: 2 IC50
Activity Spreadsheet -- Enzyme Inhibition Constant Data from BindingDB
Found 2 hits for monomerid = 50373004
Trg + Lig
Ki
nM
ΔG°
kcal/mole
IC50
nM
Kd
nM
EC50/IC50
nM
koff
s-1
kon
M-1s-1
pHTemp
°C
Fibronectin receptor beta/Integrin alpha-4
(Homo sapiens (Human))
BDBM50373004
(CHEMBL258134)
Show SMILES Cn1ncc(-c2ccc(F)cc2)c(-c2ccc(C[C@H](NC(=O)c3c(Cl)cccc3Cl)C(O)=O)cc2)c1=O
Show InChI InChI=1S/C27H20Cl2FN3O4/c1-33-26(35)23(19(14-31-33)16-9-11-18(30)12-10-16)17-7-5-15(6-8-17)13-22(27(36)37)32-25(34)24-20(28)3-2-4-21(24)29/h2-12,14,22H,13H2,1H3,(H,32,34)(H,36,37)/t22-/m0/s1
Reactome pathway
n/an/a 460n/an/an/an/an/an/a
Johnson& Johnson Pharmaceutical Research& Development
Curated by ChEMBL
Assay Description
Inhibition of human integrin alpha-4-beta-1-mediated Ramos cell adhesion to immobilized VCAM1
Bioorg Med Chem Lett 18: 1331-5 (2008)
Article DOI: 10.1016/j.bmcl.2008.01.022
BindingDB Entry DOI: 10.7270/Q2TD9Z6W
Integrin α4β7
(Homo sapiens (Human))
BDBM50373004
(CHEMBL258134)
Show SMILES Cn1ncc(-c2ccc(F)cc2)c(-c2ccc(C[C@H](NC(=O)c3c(Cl)cccc3Cl)C(O)=O)cc2)c1=O
Show InChI InChI=1S/C27H20Cl2FN3O4/c1-33-26(35)23(19(14-31-33)16-9-11-18(30)12-10-16)17-7-5-15(6-8-17)13-22(27(36)37)32-25(34)24-20(28)3-2-4-21(24)29/h2-12,14,22H,13H2,1H3,(H,32,34)(H,36,37)/t22-/m0/s1
NCI pathway
Reactome pathway
n/an/a 19n/an/an/an/an/an/a
Johnson& Johnson Pharmaceutical Research& Development
Curated by ChEMBL
Assay Description
Inhibition of human integrin alpha-4-beta-7-mediated K562 cell adhesion to immobilized MAdCAM1
Bioorg Med Chem Lett 18: 1331-5 (2008)
Article DOI: 10.1016/j.bmcl.2008.01.022
BindingDB Entry DOI: 10.7270/Q2TD9Z6W