null
SMILES: O=C1OCCC1NS(=O)(=O)NCCCCc1ccccc1
InChI Key: InChIKey=UHGKYKJGVGTZKW-UHFFFAOYSA-N
Activity Spreadsheet -- Enzyme Inhibition Constant Data from BindingDB
Found 1 hit for monomerid = 50373049
Trg + Lig
Ki
nM
ΔG°
kcal/mole
IC50
nM
Kd
nM
EC50/IC50
nM
koff
s-1
kon
M-1s-1
pHTemp
°C
Transcriptional activator protein LuxR
(Vibrio fischeri)
BDBM50373049
(CHEMBL408121)
Show SMILES O=C1OCCC1NS(=O)(=O)NCCCCc1ccccc1
Show InChI InChI=1S/C14H20N2O4S/c17-14-13(9-11-20-14)16-21(18,19)15-10-5-4-8-12-6-2-1-3-7-12/h1-3,6-7,13,15-16H,4-5,8-11H2
n/an/a 1.30E+4n/an/an/an/an/an/a
INSA Lyon
Curated by ChEMBL
Assay Description
Antagonist activity at LuxR in Vibrio fischeri assessed as inhibition of N-3-oxos-hexanoyl-L-homoserine lactone induced luminescence
Bioorg Med Chem 16: 3550-6 (2008)
Article DOI: 10.1016/j.bmc.2008.02.023
BindingDB Entry DOI: 10.7270/Q2X63NTT