BDBM50373116 MEPTAZINOL::US10231963, Table B.11::US10736890, Compound TABLE B.11::US9656961, Example 00128
SMILES: CCC1(CCCCN(C)C1)c1cccc(O)c1
InChI Key: InChIKey=JLICHNCFTLFZJN-UHFFFAOYSA-N
Data: 3 KI  3 IC50  2 EC50
Activity Spreadsheet -- Enzyme Inhibition Constant Data from BindingDB
Found 8 hits for monomerid = 50373116
Trg + Lig
Ki
nM
ΔG°
kcal/mole
IC50
nM
Kd
nM
EC50/IC50
nM
koff
s-1
kon
M-1s-1
pHTemp
°C
Mu-type opioid receptor
(Homo sapiens (Human))
BDBM50373116
(MEPTAZINOL | US10231963, Table B.11 | US10736890, ...)
Show SMILES CCC1(CCCCN(C)C1)c1cccc(O)c1
Show InChI InChI=1S/C15H23NO/c1-3-15(9-4-5-10-16(2)12-15)13-7-6-8-14(17)11-13/h6-8,11,17H,3-5,9-10,12H2,1-2H3
NCI pathway
Reactome pathway
US Patent
32n/an/an/an/an/an/an/an/a
ALKERMES PHARMA IRELAND LIMITED
US Patent
Assay Description
The Ki (binding affinity) for μ opioid receptors was determined using a competitive displacement assay as previously described in Neumeyer (Jour...
US Patent US10736890 (2020)
Mu-type opioid receptor
(Homo sapiens (Human))
BDBM50373116
(MEPTAZINOL | US10231963, Table B.11 | US10736890, ...)
Show SMILES CCC1(CCCCN(C)C1)c1cccc(O)c1
Show InChI InChI=1S/C15H23NO/c1-3-15(9-4-5-10-16(2)12-15)13-7-6-8-14(17)11-13/h6-8,11,17H,3-5,9-10,12H2,1-2H3
NCI pathway
Reactome pathway
US Patent
32n/an/an/an/an/an/an/an/a
ALKERMES PHARMA IRELAND LIMITED
US Patent
Assay Description
The Ki (binding affinity) for opioid receptors was determined using a competitive displacement assay as previously described in Neumeyer (Journal of ...
US Patent US9656961 (2017)
BindingDB Entry DOI: 10.7270/Q2PR7Z13
Mu-type opioid receptor
(Homo sapiens (Human))
BDBM50373116
(MEPTAZINOL | US10231963, Table B.11 | US10736890, ...)
Show SMILES CCC1(CCCCN(C)C1)c1cccc(O)c1
Show InChI InChI=1S/C15H23NO/c1-3-15(9-4-5-10-16(2)12-15)13-7-6-8-14(17)11-13/h6-8,11,17H,3-5,9-10,12H2,1-2H3
NCI pathway
Reactome pathway
US Patent
32n/an/an/an/an/an/an/an/a
Universita degli Studi di Bari
Assay Description
The Ki (binding affinity) for opioid receptors was determined using a competitive displacement assay as previously described in Neumeyer (Journal of ...
J Med Chem 50: 4214-21 (2007)
BindingDB Entry DOI: 10.7270/Q2W66P26
Solute carrier family 22 member 1
(Homo sapiens (Human))
BDBM50373116
(MEPTAZINOL | US10231963, Table B.11 | US10736890, ...)
Show SMILES CCC1(CCCCN(C)C1)c1cccc(O)c1
Show InChI InChI=1S/C15H23NO/c1-3-15(9-4-5-10-16(2)12-15)13-7-6-8-14(17)11-13/h6-8,11,17H,3-5,9-10,12H2,1-2H3
n/an/a 1.90E+4n/an/an/an/an/an/a
University Medicine Greifswald
Curated by ChEMBL
Assay Description
Inhibition of human OCT1 expressed in HEK293 cells assessed as reduction in ASP+ substrate uptake by microplate reader based analysis
J Med Chem 62: 9890-9905 (2019)
Article DOI: 10.1021/acs.jmedchem.9b01301
Mu-type opioid receptor
(Homo sapiens (Human))
BDBM50373116
(MEPTAZINOL | US10231963, Table B.11 | US10736890, ...)
Show SMILES CCC1(CCCCN(C)C1)c1cccc(O)c1
Show InChI InChI=1S/C15H23NO/c1-3-15(9-4-5-10-16(2)12-15)13-7-6-8-14(17)11-13/h6-8,11,17H,3-5,9-10,12H2,1-2H3
NCI pathway
Reactome pathway
US Patent
n/an/an/an/a>600n/an/an/an/a
Universita degli Studi di Bari
Assay Description
The Ki (binding affinity) for opioid receptors was determined using a competitive displacement assay as previously described in Neumeyer (Journal of ...
J Med Chem 50: 4214-21 (2007)
BindingDB Entry DOI: 10.7270/Q2W66P26
Acetylcholinesterase
(Mus musculus (mouse))
BDBM50373116
(MEPTAZINOL | US10231963, Table B.11 | US10736890, ...)
Show SMILES CCC1(CCCCN(C)C1)c1cccc(O)c1
Show InChI InChI=1S/C15H23NO/c1-3-15(9-4-5-10-16(2)12-15)13-7-6-8-14(17)11-13/h6-8,11,17H,3-5,9-10,12H2,1-2H3
Reactome pathway
n/an/a 4.10E+4n/an/an/an/an/an/a
Fudan University
Curated by ChEMBL
Assay Description
Inhibition of mouse brain AChE
J Med Chem 51: 2027-36 (2008)
Article DOI: 10.1021/jm070154q
BindingDB Entry DOI: 10.7270/Q2C82B4G
Butyrylcholinesterase
(Mus musculus (Mouse))
BDBM50373116
(MEPTAZINOL | US10231963, Table B.11 | US10736890, ...)
Show SMILES CCC1(CCCCN(C)C1)c1cccc(O)c1
Show InChI InChI=1S/C15H23NO/c1-3-15(9-4-5-10-16(2)12-15)13-7-6-8-14(17)11-13/h6-8,11,17H,3-5,9-10,12H2,1-2H3
Reactome pathway
n/an/a 1.50E+4n/an/an/an/an/an/a
Fudan University
Curated by ChEMBL
Assay Description
Inhibition of mouse serum BChE
J Med Chem 51: 2027-36 (2008)
Article DOI: 10.1021/jm070154q
BindingDB Entry DOI: 10.7270/Q2C82B4G
Mu-type opioid receptor
(Homo sapiens (Human))
BDBM50373116
(MEPTAZINOL | US10231963, Table B.11 | US10736890, ...)
Show SMILES CCC1(CCCCN(C)C1)c1cccc(O)c1
Show InChI InChI=1S/C15H23NO/c1-3-15(9-4-5-10-16(2)12-15)13-7-6-8-14(17)11-13/h6-8,11,17H,3-5,9-10,12H2,1-2H3
NCI pathway
Reactome pathway
US Patent
n/an/an/an/a>600n/an/an/an/a
ALKERMES PHARMA IRELAND LIMITED
US Patent
Assay Description
The Ki (binding affinity) for opioid receptors was determined using a competitive displacement assay as previously described in Neumeyer (Journal of ...
US Patent US9656961 (2017)
BindingDB Entry DOI: 10.7270/Q2PR7Z13