BDBM50373195 CHEMBL259812
SMILES: COC(=O)c1c(-c2ccccc2)c2cc(Cl)ccc2c(=O)n1Cc1ccc(cc1)S(C)(=O)=O
InChI Key: InChIKey=VSABDUPEBFEMEV-UHFFFAOYSA-N
Data: 1 IC50
Activity Spreadsheet -- Enzyme Inhibition Constant Data from BindingDB
Found 1 hit for monomerid = 50373195
Trg + Lig
Ki
nM
ΔG°
kcal/mole
IC50
nM
Kd
nM
EC50/IC50
nM
koff
s-1
kon
M-1s-1
pHTemp
°C
Mitogen-activated protein kinase 8
(Homo sapiens (Human))
BDBM50373195
(CHEMBL259812)
Show SMILES COC(=O)c1c(-c2ccccc2)c2cc(Cl)ccc2c(=O)n1Cc1ccc(cc1)S(C)(=O)=O
Show InChI InChI=1S/C25H20ClNO5S/c1-32-25(29)23-22(17-6-4-3-5-7-17)21-14-18(26)10-13-20(21)24(28)27(23)15-16-8-11-19(12-9-16)33(2,30)31/h3-14H,15H2,1-2H3
NCI pathway
Reactome pathway
n/an/a 28n/an/an/an/an/an/a
Takeda Pharmaceutical Company, Ltd
Curated by ChEMBL
Assay Description
Inhibition of human JNK1 by radiometric assay
Bioorg Med Chem 16: 4715-32 (2008)
Article DOI: 10.1016/j.bmc.2008.02.027
BindingDB Entry DOI: 10.7270/Q2JS9R8M