BDBM50373204 CHEMBL259706
SMILES: COC(=O)c1c(-c2ccccc2)c2cc(Br)ccc2c(=O)n1Cc1ccc(cc1)C(O)=O
InChI Key: InChIKey=BJGJJTLRJRJKFX-UHFFFAOYSA-N
Data: 1 IC50
Activity Spreadsheet -- Enzyme Inhibition Constant Data from BindingDB
Found 1 hit for monomerid = 50373204
Trg + Lig
Ki
nM
ΔG°
kcal/mole
IC50
nM
Kd
nM
EC50/IC50
nM
koff
s-1
kon
M-1s-1
pHTemp
°C
Mitogen-activated protein kinase 8
(Homo sapiens (Human))
BDBM50373204
(CHEMBL259706)
Show SMILES COC(=O)c1c(-c2ccccc2)c2cc(Br)ccc2c(=O)n1Cc1ccc(cc1)C(O)=O
Show InChI InChI=1S/C25H18BrNO5/c1-32-25(31)22-21(16-5-3-2-4-6-16)20-13-18(26)11-12-19(20)23(28)27(22)14-15-7-9-17(10-8-15)24(29)30/h2-13H,14H2,1H3,(H,29,30)
NCI pathway
Reactome pathway
n/an/a 20n/an/an/an/an/an/a
Takeda Pharmaceutical Company, Ltd
Curated by ChEMBL
Assay Description
Inhibition of human JNK1 by radiometric assay
Bioorg Med Chem 16: 4715-32 (2008)
Article DOI: 10.1016/j.bmc.2008.02.027
BindingDB Entry DOI: 10.7270/Q2JS9R8M