BDBM50373208 CHEMBL409936
SMILES: COC(=O)c1c(-c2ccccc2)c2cc(Br)ccc2c(=O)n1Cc1ccccc1OC
InChI Key: InChIKey=FXSXFGVWHFAMCW-UHFFFAOYSA-N
Data: 1 IC50
Activity Spreadsheet -- Enzyme Inhibition Constant Data from BindingDB
Found 1 hit for monomerid = 50373208
Trg + Lig
Ki
nM
ΔG°
kcal/mole
IC50
nM
Kd
nM
EC50/IC50
nM
koff
s-1
kon
M-1s-1
pHTemp
°C
Mitogen-activated protein kinase 8
(Homo sapiens (Human))
BDBM50373208
(CHEMBL409936)
Show SMILES COC(=O)c1c(-c2ccccc2)c2cc(Br)ccc2c(=O)n1Cc1ccccc1OC
Show InChI InChI=1S/C25H20BrNO4/c1-30-21-11-7-6-10-17(21)15-27-23(25(29)31-2)22(16-8-4-3-5-9-16)20-14-18(26)12-13-19(20)24(27)28/h3-14H,15H2,1-2H3
NCI pathway
Reactome pathway
n/an/a 100n/an/an/an/an/an/a
Takeda Pharmaceutical Company, Ltd
Curated by ChEMBL
Assay Description
Inhibition of human JNK1 by radiometric assay
Bioorg Med Chem 16: 4715-32 (2008)
Article DOI: 10.1016/j.bmc.2008.02.027
BindingDB Entry DOI: 10.7270/Q2JS9R8M