null
SMILES: Fc1cc2nc([nH]c2cc1N1CCNCC1)S(=O)(=O)Cc1cccc(Cl)c1Cl
InChI Key: InChIKey=DRYTYYZFPGOGGU-UHFFFAOYSA-N
Activity Spreadsheet -- Enzyme Inhibition Constant Data from BindingDB
Found 1 hit for monomerid = 50373371
Trg + Lig
Ki
nM
ΔG°
kcal/mole
IC50
nM
Kd
nM
EC50/IC50
nM
koff
s-1
kon
M-1s-1
pHTemp
°C
Nociceptin receptor
(Homo sapiens (Human))
BDBM50373371
(CHEMBL407068)
Show SMILES Fc1cc2nc([nH]c2cc1N1CCNCC1)S(=O)(=O)Cc1cccc(Cl)c1Cl
Show InChI InChI=1S/C18H17Cl2FN4O2S/c19-12-3-1-2-11(17(12)20)10-28(26,27)18-23-14-8-13(21)16(9-15(14)24-18)25-6-4-22-5-7-25/h1-3,8-9,22H,4-7,10H2,(H,23,24)
Reactome pathway
n/an/a 240n/an/an/an/an/an/a
Banyu Tsukuba Research Institute
Curated by ChEMBL
Assay Description
Displacement of [125I]Tyr14-NC from human ORL1 receptor expressed in CHO cell membrane
Bioorg Med Chem Lett 18: 3278-81 (2008)
Article DOI: 10.1016/j.bmcl.2008.04.054
BindingDB Entry DOI: 10.7270/Q2HT2Q57