BDBM50373373 CHEMBL260820
SMILES: Fc1cc2nc(SCc3cccc(Cl)c3Cl)[nH]c2cc1N1CCNCC1
InChI Key: InChIKey=FROPEUUNCJWFSP-UHFFFAOYSA-N
Data: 2 IC50
Activity Spreadsheet -- Enzyme Inhibition Constant Data from BindingDB
Found 2 hits for monomerid = 50373373
Trg + Lig
Ki
nM
ΔG°
kcal/mole
IC50
nM
Kd
nM
EC50/IC50
nM
koff
s-1
kon
M-1s-1
pHTemp
°C
Nociceptin receptor
(Homo sapiens (Human))
BDBM50373373
(CHEMBL260820)
Show SMILES Fc1cc2nc(SCc3cccc(Cl)c3Cl)[nH]c2cc1N1CCNCC1
Show InChI InChI=1S/C18H17Cl2FN4S/c19-12-3-1-2-11(17(12)20)10-26-18-23-14-8-13(21)16(9-15(14)24-18)25-6-4-22-5-7-25/h1-3,8-9,22H,4-7,10H2,(H,23,24)
Reactome pathway
n/an/a 6n/an/an/an/an/an/a
Banyu Tsukuba Research Institute
Curated by ChEMBL
Assay Description
Displacement of [125I]Tyr14-NC from human ORL1 receptor expressed in CHO cell membrane
Bioorg Med Chem Lett 18: 3278-81 (2008)
Article DOI: 10.1016/j.bmcl.2008.04.054
BindingDB Entry DOI: 10.7270/Q2HT2Q57
Nociceptin receptor
(Homo sapiens (Human))
BDBM50373373
(CHEMBL260820)
Show SMILES Fc1cc2nc(SCc3cccc(Cl)c3Cl)[nH]c2cc1N1CCNCC1
Show InChI InChI=1S/C18H17Cl2FN4S/c19-12-3-1-2-11(17(12)20)10-26-18-23-14-8-13(21)16(9-15(14)24-18)25-6-4-22-5-7-25/h1-3,8-9,22H,4-7,10H2,(H,23,24)
Reactome pathway
n/an/a 140n/an/an/an/an/an/a
Banyu Tsukuba Research Institute
Curated by ChEMBL
Assay Description
Antagonist activity at human ORL1 receptor expressed in CHO cell membrane by [35S]GTP-gamma-S binding assay
Bioorg Med Chem Lett 18: 3278-81 (2008)
Article DOI: 10.1016/j.bmcl.2008.04.054
BindingDB Entry DOI: 10.7270/Q2HT2Q57