null
SMILES: CC(C)(C)Cn1cnc2ccc(nc12)-c1nc([nH]c1-c1ccc(F)cc1F)C(C)(C)C
InChI Key: InChIKey=JGJVCJKVGPBNRU-UHFFFAOYSA-N
Activity Spreadsheet -- Enzyme Inhibition Constant Data from BindingDB
Found 2 hits for monomerid = 50373946
Trg + Lig
Ki
nM
ΔG°
kcal/mole
IC50
nM
Kd
nM
EC50/IC50
nM
koff
s-1
kon
M-1s-1
pHTemp
°C
Mitogen-activated protein kinase 14
(Mus musculus (mouse))
BDBM50373946
(CHEMBL270657)
Show SMILES CC(C)(C)Cn1cnc2ccc(nc12)-c1nc([nH]c1-c1ccc(F)cc1F)C(C)(C)C
Show InChI InChI=1S/C24H27F2N5/c1-23(2,3)12-31-13-27-18-10-9-17(28-21(18)31)20-19(29-22(30-20)24(4,5)6)15-8-7-14(25)11-16(15)26/h7-11,13H,12H2,1-6H3,(H,29,30)
Reactome pathway
n/an/a 20.7n/an/an/an/an/an/a
Eli Lilly and Co.
Curated by ChEMBL
Assay Description
Inhibition of mouse p38alpha in anisomycin-stimulated RAW 264.7 cells by ELISA
Bioorg Med Chem Lett 18: 179-83 (2008)
Article DOI: 10.1016/j.bmcl.2007.10.106
BindingDB Entry DOI: 10.7270/Q2R78G31
Mitogen-activated protein kinase 14
(Homo sapiens (Human))
BDBM50373946
(CHEMBL270657)
Show SMILES CC(C)(C)Cn1cnc2ccc(nc12)-c1nc([nH]c1-c1ccc(F)cc1F)C(C)(C)C
Show InChI InChI=1S/C24H27F2N5/c1-23(2,3)12-31-13-27-18-10-9-17(28-21(18)31)20-19(29-22(30-20)24(4,5)6)15-8-7-14(25)11-16(15)26/h7-11,13H,12H2,1-6H3,(H,29,30)
NCI pathway
Reactome pathway
n/an/a 2.30n/an/an/an/an/an/a
Eli Lilly and Co.
Curated by ChEMBL
Assay Description
Inhibition of human recombinant p38alpha
Bioorg Med Chem Lett 18: 179-83 (2008)
Article DOI: 10.1016/j.bmcl.2007.10.106
BindingDB Entry DOI: 10.7270/Q2R78G31