null
SMILES: CC(C)(C)Cn1cnc2ccc(nc12)-c1nc([nH]c1-c1ccc(F)cc1)-c1c(Cl)cccc1Cl
InChI Key: InChIKey=DMMIDJRAQDTYAE-UHFFFAOYSA-N
Activity Spreadsheet -- Enzyme Inhibition Constant Data from BindingDB
Found 2 hits for monomerid = 50373947
Trg + Lig
Ki
nM
ΔG°
kcal/mole
IC50
nM
Kd
nM
EC50/IC50
nM
koff
s-1
kon
M-1s-1
pHTemp
°C
Mitogen-activated protein kinase 14
(Mus musculus (mouse))
BDBM50373947
(CHEMBL274201)
Show SMILES CC(C)(C)Cn1cnc2ccc(nc12)-c1nc([nH]c1-c1ccc(F)cc1)-c1c(Cl)cccc1Cl
Show InChI InChI=1S/C26H22Cl2FN5/c1-26(2,3)13-34-14-30-20-12-11-19(31-25(20)34)23-22(15-7-9-16(29)10-8-15)32-24(33-23)21-17(27)5-4-6-18(21)28/h4-12,14H,13H2,1-3H3,(H,32,33)
Reactome pathway
n/an/a 23n/an/an/an/an/an/a
Eli Lilly and Co.
Curated by ChEMBL
Assay Description
Inhibition of mouse p38alpha in anisomycin-stimulated RAW 264.7 cells by ELISA
Bioorg Med Chem Lett 18: 179-83 (2008)
Article DOI: 10.1016/j.bmcl.2007.10.106
BindingDB Entry DOI: 10.7270/Q2R78G31
Mitogen-activated protein kinase 14
(Homo sapiens (Human))
BDBM50373947
(CHEMBL274201)
Show SMILES CC(C)(C)Cn1cnc2ccc(nc12)-c1nc([nH]c1-c1ccc(F)cc1)-c1c(Cl)cccc1Cl
Show InChI InChI=1S/C26H22Cl2FN5/c1-26(2,3)13-34-14-30-20-12-11-19(31-25(20)34)23-22(15-7-9-16(29)10-8-15)32-24(33-23)21-17(27)5-4-6-18(21)28/h4-12,14H,13H2,1-3H3,(H,32,33)
NCI pathway
Reactome pathway
n/an/a 3.60n/an/an/an/an/an/a
Eli Lilly and Co.
Curated by ChEMBL
Assay Description
Inhibition of human recombinant p38alpha
Bioorg Med Chem Lett 18: 179-83 (2008)
Article DOI: 10.1016/j.bmcl.2007.10.106
BindingDB Entry DOI: 10.7270/Q2R78G31