null
SMILES: CC(C)Cn1cnc2ccc(nc12)-c1nc([nH]c1-c1ccccc1)-c1c(F)cccc1F
InChI Key: InChIKey=WVRVCBOBBRMCCQ-UHFFFAOYSA-N
Activity Spreadsheet -- Enzyme Inhibition Constant Data from BindingDB
Found 2 hits for monomerid = 50373966
Trg + Lig
Ki
nM
ΔG°
kcal/mole
IC50
nM
Kd
nM
EC50/IC50
nM
koff
s-1
kon
M-1s-1
pHTemp
°C
Mitogen-activated protein kinase 14
(Mus musculus (mouse))
BDBM50373966
(CHEMBL272989)
Show SMILES CC(C)Cn1cnc2ccc(nc12)-c1nc([nH]c1-c1ccccc1)-c1c(F)cccc1F
Show InChI InChI=1S/C25H21F2N5/c1-15(2)13-32-14-28-20-12-11-19(29-25(20)32)23-22(16-7-4-3-5-8-16)30-24(31-23)21-17(26)9-6-10-18(21)27/h3-12,14-15H,13H2,1-2H3,(H,30,31)
Reactome pathway
n/an/a 69.7n/an/an/an/an/an/a
Eli Lilly and Co.
Curated by ChEMBL
Assay Description
Inhibition of mouse p38alpha in anisomycin-stimulated RAW 264.7 cells by ELISA
Bioorg Med Chem Lett 18: 179-83 (2008)
Article DOI: 10.1016/j.bmcl.2007.10.106
BindingDB Entry DOI: 10.7270/Q2R78G31
Mitogen-activated protein kinase 14
(Homo sapiens (Human))
BDBM50373966
(CHEMBL272989)
Show SMILES CC(C)Cn1cnc2ccc(nc12)-c1nc([nH]c1-c1ccccc1)-c1c(F)cccc1F
Show InChI InChI=1S/C25H21F2N5/c1-15(2)13-32-14-28-20-12-11-19(29-25(20)32)23-22(16-7-4-3-5-8-16)30-24(31-23)21-17(26)9-6-10-18(21)27/h3-12,14-15H,13H2,1-2H3,(H,30,31)
NCI pathway
Reactome pathway
n/an/a 4.5n/an/an/an/an/an/a
Eli Lilly and Co.
Curated by ChEMBL
Assay Description
Inhibition of human recombinant p38alpha
Bioorg Med Chem Lett 18: 179-83 (2008)
Article DOI: 10.1016/j.bmcl.2007.10.106
BindingDB Entry DOI: 10.7270/Q2R78G31