BDBM50374017 CHEMBL255737
SMILES: Nc1cccc(c1)C(=O)Nc1cc(ccc1O)-c1ccccc1
InChI Key: InChIKey=WJSKIWPSBKAGQW-UHFFFAOYSA-N
Data: 1 IC50
Activity Spreadsheet -- Enzyme Inhibition Constant Data from BindingDB
Found 1 hit for monomerid = 50374017
Trg + Lig
Ki
nM
ΔG°
kcal/mole
IC50
nM
Kd
nM
EC50/IC50
nM
koff
s-1
kon
M-1s-1
pHTemp
°C
Histone deacetylase 1
(Homo sapiens (Human))
BDBM50374017
(CHEMBL255737)
Show SMILES Nc1cccc(c1)C(=O)Nc1cc(ccc1O)-c1ccccc1
Show InChI InChI=1S/C19H16N2O2/c20-16-8-4-7-15(11-16)19(23)21-17-12-14(9-10-18(17)22)13-5-2-1-3-6-13/h1-12,22H,20H2,(H,21,23)
NCI pathway
Reactome pathway
n/an/a 440n/an/an/an/an/an/a
Merck Research Laboratories
Curated by ChEMBL
Assay Description
Inhibition of HDAC1
Bioorg Med Chem Lett 18: 973-8 (2008)
Article DOI: 10.1016/j.bmcl.2007.12.031
BindingDB Entry DOI: 10.7270/Q2765G5S