BDBM50374060 CHEMBL272267
SMILES: Cn1c2cc(C(=O)NCCN3CCCC3)c(O)cc2c2c3C(=O)NC(=O)c3c(cc12)-c1ccccc1Cl
InChI Key: InChIKey=LFRLUVCEFWYSFT-UHFFFAOYSA-N
Data: 2 IC50
PDB links: 1 PDB ID matches this monomer.
Activity Spreadsheet -- Enzyme Inhibition Constant Data from BindingDB
Found 2 hits for monomerid = 50374060
Trg + Lig
Ki
nM
ΔG°
kcal/mole
IC50
nM
Kd
nM
EC50/IC50
nM
koff
s-1
kon
M-1s-1
pHTemp
°C
Serine/threonine-protein kinase WEE1
(Homo sapiens (Human))
BDBM50374060
(CHEMBL272267)
Show SMILES Cn1c2cc(C(=O)NCCN3CCCC3)c(O)cc2c2c3C(=O)NC(=O)c3c(cc12)-c1ccccc1Cl
Show InChI InChI=1S/C28H25ClN4O4/c1-32-20-13-18(26(35)30-8-11-33-9-4-5-10-33)22(34)14-17(20)23-21(32)12-16(15-6-2-3-7-19(15)29)24-25(23)28(37)31-27(24)36/h2-3,6-7,12-14,34H,4-5,8-11H2,1H3,(H,30,35)(H,31,36,37)
NCI pathway
Reactome pathway
n/an/a 15n/an/an/an/an/an/a
University of Auckland
Curated by ChEMBL
Assay Description
Inhibition of human Wee1
Bioorg Med Chem Lett 18: 929-33 (2008)
Article DOI: 10.1016/j.bmcl.2007.12.046
BindingDB Entry DOI: 10.7270/Q2ZS2XC3
3D
3D Structure (crystal)
Serine/threonine-protein kinase Chk1
(Homo sapiens (Human))
BDBM50374060
(CHEMBL272267)
Show SMILES Cn1c2cc(C(=O)NCCN3CCCC3)c(O)cc2c2c3C(=O)NC(=O)c3c(cc12)-c1ccccc1Cl
Show InChI InChI=1S/C28H25ClN4O4/c1-32-20-13-18(26(35)30-8-11-33-9-4-5-10-33)22(34)14-17(20)23-21(32)12-16(15-6-2-3-7-19(15)29)24-25(23)28(37)31-27(24)36/h2-3,6-7,12-14,34H,4-5,8-11H2,1H3,(H,30,35)(H,31,36,37)
Reactome pathway
n/an/a 242n/an/an/an/an/an/a
University of Auckland
Curated by ChEMBL
Assay Description
Inhibition of Chk1
Bioorg Med Chem Lett 18: 929-33 (2008)
Article DOI: 10.1016/j.bmcl.2007.12.046
BindingDB Entry DOI: 10.7270/Q2ZS2XC3