BDBM50374279 OHIOENSIN A
SMILES: Oc1ccc-2c(c1)[C@@H]1Oc3ccccc3[C@H]3CC(=O)c4c(O)cc(O)c-2c4[C@@H]13
InChI Key: InChIKey=DBGJQYIYUBGFLT-GQIHDASDSA-N
Data: 2 IC50
Activity Spreadsheet -- Enzyme Inhibition Constant Data from BindingDB
Found 2 hits for monomerid = 50374279
Trg + Lig
Ki
nM
ΔG°
kcal/mole
IC50
nM
Kd
nM
EC50/IC50
nM
koff
s-1
kon
M-1s-1
pHTemp
°C
Tyrosine-protein phosphatase non-receptor type 1
(Homo sapiens (Human))
BDBM50374279
(OHIOENSIN A)
Show SMILES Oc1ccc-2c(c1)[C@@H]1Oc3ccccc3[C@H]3CC(=O)c4c(O)cc(O)c-2c4[C@@H]13 |r|
Show InChI InChI=1S/C23H16O5/c24-10-5-6-12-14(7-10)23-20-13(11-3-1-2-4-18(11)28-23)8-15(25)21-17(27)9-16(26)19(12)22(20)21/h1-7,9,13,20,23-24,26-27H,8H2/t13-,20+,23+/m1/s1
NCI pathway
Reactome pathway
n/an/a 3.50E+3n/an/an/an/an/an/a
University of Copenhagen
Curated by ChEMBL
Assay Description
Inhibition of GST-tagged human PTP1B expressed in Escherichia coli using pNPP substrate assessed as reduction in p-nitrophenol release
J Nat Prod 79: 1063-72 (2016)
Article DOI: 10.1021/acs.jnatprod.5b01128
Tyrosine-protein phosphatase non-receptor type 1
(Homo sapiens (Human))
BDBM50374279
(OHIOENSIN A)
Show SMILES Oc1ccc-2c(c1)[C@@H]1Oc3ccccc3[C@H]3CC(=O)c4c(O)cc(O)c-2c4[C@@H]13 |r|
Show InChI InChI=1S/C23H16O5/c24-10-5-6-12-14(7-10)23-20-13(11-3-1-2-4-18(11)28-23)8-15(25)21-17(27)9-16(26)19(12)22(20)21/h1-7,9,13,20,23-24,26-27H,8H2/t13-,20+,23+/m1/s1
NCI pathway
Reactome pathway
n/an/a 4.30E+3n/an/an/an/an/an/a
Silla University
Curated by ChEMBL
Assay Description
Inhibition of human recombinant PTP1B
Bioorg Med Chem Lett 18: 772-5 (2008)
Article DOI: 10.1016/j.bmcl.2007.11.036
BindingDB Entry DOI: 10.7270/Q25B03BB