BDBM50374494 CHEMBL271736
SMILES: CN1CCN(CCN(c2cccn(O)c2=O)S(=O)(=O)c2ccc(Oc3ccc(Cl)cc3)cc2)CC1
InChI Key: InChIKey=JGESVFFMSKZGDK-UHFFFAOYSA-N
Data: 2 IC50
Activity Spreadsheet -- Enzyme Inhibition Constant Data from BindingDB
Found 2 hits for monomerid = 50374494
Trg + Lig
Ki
nM
ΔG°
kcal/mole
IC50
nM
Kd
nM
EC50/IC50
nM
koff
s-1
kon
M-1s-1
pHTemp
°C
Matrix metalloproteinase-9
(Homo sapiens (Human))
BDBM50374494
(CHEMBL271736)
Show SMILES CN1CCN(CCN(c2cccn(O)c2=O)S(=O)(=O)c2ccc(Oc3ccc(Cl)cc3)cc2)CC1
Show InChI InChI=1S/C24H27ClN4O5S/c1-26-13-15-27(16-14-26)17-18-29(23-3-2-12-28(31)24(23)30)35(32,33)22-10-8-21(9-11-22)34-20-6-4-19(25)5-7-20/h2-12,31H,13-18H2,1H3
Reactome pathway
n/an/a 1.30n/an/an/an/an/an/a
Johnson& Johnson Pharmaceutical Research and Development
Curated by ChEMBL
Assay Description
Inhibition of MMP9
Bioorg Med Chem Lett 18: 409-13 (2008)
Article DOI: 10.1016/j.bmcl.2007.10.045
BindingDB Entry DOI: 10.7270/Q2833SWF
72 kDa type IV collagenase
(Homo sapiens (Human))
BDBM50374494
(CHEMBL271736)
Show SMILES CN1CCN(CCN(c2cccn(O)c2=O)S(=O)(=O)c2ccc(Oc3ccc(Cl)cc3)cc2)CC1
Show InChI InChI=1S/C24H27ClN4O5S/c1-26-13-15-27(16-14-26)17-18-29(23-3-2-12-28(31)24(23)30)35(32,33)22-10-8-21(9-11-22)34-20-6-4-19(25)5-7-20/h2-12,31H,13-18H2,1H3
Reactome pathway
n/an/a 1.70n/an/an/an/an/an/a
Johnson& Johnson Pharmaceutical Research and Development
Curated by ChEMBL
Assay Description
Inhibition of MMP2
Bioorg Med Chem Lett 18: 409-13 (2008)
Article DOI: 10.1016/j.bmcl.2007.10.045
BindingDB Entry DOI: 10.7270/Q2833SWF