null
SMILES: Fc1ccc(cc1)-c1[nH]c(cc1-c1ccncc1)C1CCN(CC2CNCCN2)CC1
InChI Key: InChIKey=QTUQICMZJFNWJE-UHFFFAOYSA-N
Activity Spreadsheet -- Enzyme Inhibition Constant Data from BindingDB
Found 1 hit for monomerid = 50374578
Trg + Lig
Ki
nM
ΔG°
kcal/mole
IC50
nM
Kd
nM
EC50/IC50
nM
koff
s-1
kon
M-1s-1
pHTemp
°C
cGMP-dependent protein kinase
(Eimeria tenella)
BDBM50374578
(CHEMBL401749)
Show SMILES Fc1ccc(cc1)-c1[nH]c(cc1-c1ccncc1)C1CCN(CC2CNCCN2)CC1 |w:23.25|
Show InChI InChI=1S/C25H30FN5/c26-21-3-1-20(2-4-21)25-23(18-5-9-27-10-6-18)15-24(30-25)19-7-13-31(14-8-19)17-22-16-28-11-12-29-22/h1-6,9-10,15,19,22,28-30H,7-8,11-14,16-17H2
n/an/a 0.0700n/an/an/an/an/an/a
Merck Research Laboratories
Curated by ChEMBL
Assay Description
Inhibition of Eimeria tenella cGMP-dependent protein kinase
Bioorg Med Chem Lett 18: 2019-22 (2008)
Article DOI: 10.1016/j.bmcl.2008.01.104
BindingDB Entry DOI: 10.7270/Q2BV7HHX