BDBM50374596 CHEMBL406081::US9724435, Compound SN-99
SMILES: O=c1sc2ccccc2n1CCCCCN1CCN(CC1)C1CCCCC1
InChI Key: InChIKey=YQBLPRIQIPGWFI-UHFFFAOYSA-N
Data: 5 KI
Activity Spreadsheet -- Enzyme Inhibition Constant Data from BindingDB
Found 5 hits for monomerid = 50374596
Trg + Lig
Ki
nM
ΔG°
kcal/mole
IC50
nM
Kd
nM
EC50/IC50
nM
koff
s-1
kon
M-1s-1
pHTemp
°C
Sigma-2 receptor
(Rattus norvegicus (Rat))
BDBM50374596
(CHEMBL406081 | US9724435, Compound SN-99)
Show SMILES O=c1sc2ccccc2n1CCCCCN1CCN(CC1)C1CCCCC1
Show InChI InChI=1S/C22H33N3OS/c26-22-25(20-11-5-6-12-21(20)27-22)14-8-2-7-13-23-15-17-24(18-16-23)19-9-3-1-4-10-19/h5-6,11-12,19H,1-4,7-10,13-18H2
US Patent
2.44n/an/an/an/an/an/an/an/a
THE UNIVERSITY OF MISSISSIPPI; THE BOARD OF TRUSTEES OF THE LELAND STANFORD JUNIOR UNIVERSITY
US Patent
Assay Description
Compounds were evaluated for σ-1 and σ-2 binding in rat brain homogenates. Twelve concentrations of each test ligand (0.001-1,000 nM) were ...
US Patent US9724435 (2017)
BindingDB Entry DOI: 10.7270/Q2BZ6856
Sigma-2 receptor
(Rattus norvegicus (Rat))
BDBM50374596
(CHEMBL406081 | US9724435, Compound SN-99)
Show SMILES O=c1sc2ccccc2n1CCCCCN1CCN(CC1)C1CCCCC1
Show InChI InChI=1S/C22H33N3OS/c26-22-25(20-11-5-6-12-21(20)27-22)14-8-2-7-13-23-15-17-24(18-16-23)19-9-3-1-4-10-19/h5-6,11-12,19H,1-4,7-10,13-18H2
US Patent
2.44n/an/an/an/an/an/an/an/a
THE UNIVERSITY OF MISSISSIPPI; THE BOARD OF TRUSTEES OF THE LELAND STANFORD JUNIOR UNIVERSITY
US Patent
Assay Description
Compounds were evaluated for σ-1 and σ-2 binding in rat brain homogenates. Twelve concentrations of each test ligand (0.001-1,000 nM) were ...
US Patent US9724435 (2017)
BindingDB Entry DOI: 10.7270/Q2BZ6856
Sigma non-opioid intracellular receptor 1
(RAT)
BDBM50374596
(CHEMBL406081 | US9724435, Compound SN-99)
Show SMILES O=c1sc2ccccc2n1CCCCCN1CCN(CC1)C1CCCCC1
Show InChI InChI=1S/C22H33N3OS/c26-22-25(20-11-5-6-12-21(20)27-22)14-8-2-7-13-23-15-17-24(18-16-23)19-9-3-1-4-10-19/h5-6,11-12,19H,1-4,7-10,13-18H2
US Patent
4.98n/an/an/an/an/an/an/an/a
THE UNIVERSITY OF MISSISSIPPI; THE BOARD OF TRUSTEES OF THE LELAND STANFORD JUNIOR UNIVERSITY
US Patent
Assay Description
Compounds were evaluated for σ-1 and σ-2 binding in rat brain homogenates. Twelve concentrations of each test ligand (0.001-1,000 nM) were ...
US Patent US9724435 (2017)
BindingDB Entry DOI: 10.7270/Q2BZ6856
Sigma non-opioid intracellular receptor 1
(RAT)
BDBM50374596
(CHEMBL406081 | US9724435, Compound SN-99)
Show SMILES O=c1sc2ccccc2n1CCCCCN1CCN(CC1)C1CCCCC1
Show InChI InChI=1S/C22H33N3OS/c26-22-25(20-11-5-6-12-21(20)27-22)14-8-2-7-13-23-15-17-24(18-16-23)19-9-3-1-4-10-19/h5-6,11-12,19H,1-4,7-10,13-18H2
US Patent
4.98n/an/an/an/an/an/an/an/a
THE UNIVERSITY OF MISSISSIPPI; THE BOARD OF TRUSTEES OF THE LELAND STANFORD JUNIOR UNIVERSITY
US Patent
Assay Description
Compounds were evaluated for σ-1 and σ-2 binding in rat brain homogenates. Twelve concentrations of each test ligand (0.001-1,000 nM) were ...
US Patent US9724435 (2017)
BindingDB Entry DOI: 10.7270/Q2BZ6856
Sigma non-opioid intracellular receptor 1
(RAT)
BDBM50374596
(CHEMBL406081 | US9724435, Compound SN-99)
Show SMILES O=c1sc2ccccc2n1CCCCCN1CCN(CC1)C1CCCCC1
Show InChI InChI=1S/C22H33N3OS/c26-22-25(20-11-5-6-12-21(20)27-22)14-8-2-7-13-23-15-17-24(18-16-23)19-9-3-1-4-10-19/h5-6,11-12,19H,1-4,7-10,13-18H2
4.98n/an/an/an/an/an/an/an/a
The University of Mississippi
Curated by PDSP Ki Database
Assay Description
Displacement of [3H](+)-pentazocine from opioid sigma1 receptor in rat brain homogenate
J Med Chem 51: 1482-6 (2008)
Article DOI: 10.1021/jm701357m
BindingDB Entry DOI: 10.7270/Q2736RTZ