BDBM50374628 CHEMBL271131
SMILES: COc1cc(Nc2ncnc(n2)-n2c(Nc3ccccc3)nc3ccccc23)cc(OC)c1OC
InChI Key: InChIKey=OYDJAYPDIUTXRU-UHFFFAOYSA-N
Data: 3 IC50
PDB links: 1 PDB ID matches this monomer.
Activity Spreadsheet -- Enzyme Inhibition Constant Data from BindingDB
Found 3 hits for monomerid = 50374628
Trg + Lig
Ki
nM
ΔG°
kcal/mole
IC50
nM
Kd
nM
EC50/IC50
nM
koff
s-1
kon
M-1s-1
pHTemp
°C
Tyrosine-protein kinase Lck
(Homo sapiens (Human))
BDBM50374628
(CHEMBL271131)
Show SMILES COc1cc(Nc2ncnc(n2)-n2c(Nc3ccccc3)nc3ccccc23)cc(OC)c1OC
Show InChI InChI=1S/C25H23N7O3/c1-33-20-13-17(14-21(34-2)22(20)35-3)28-23-26-15-27-24(31-23)32-19-12-8-7-11-18(19)30-25(32)29-16-9-5-4-6-10-16/h4-15H,1-3H3,(H,29,30)(H,26,27,28,31)
n/an/a 6n/an/an/an/an/an/a
Amgen Inc.
Curated by ChEMBL
Assay Description
Inhibition of Lck by HTRF assay
J Med Chem 51: 1637-48 (2008)
Article DOI: 10.1021/jm701095m
BindingDB Entry DOI: 10.7270/Q23B6114
3D
3D Structure (crystal)
Vascular endothelial growth factor receptor 2
(Homo sapiens (Human))
BDBM50374628
(CHEMBL271131)
Show SMILES COc1cc(Nc2ncnc(n2)-n2c(Nc3ccccc3)nc3ccccc23)cc(OC)c1OC
Show InChI InChI=1S/C25H23N7O3/c1-33-20-13-17(14-21(34-2)22(20)35-3)28-23-26-15-27-24(31-23)32-19-12-8-7-11-18(19)30-25(32)29-16-9-5-4-6-10-16/h4-15H,1-3H3,(H,29,30)(H,26,27,28,31)
NCI pathway
Reactome pathway
n/an/a 7n/an/an/an/an/an/a
Amgen Inc.
Curated by ChEMBL
Assay Description
Inhibition of KDR by HTRF assay
J Med Chem 51: 1637-48 (2008)
Article DOI: 10.1021/jm701095m
BindingDB Entry DOI: 10.7270/Q23B6114
Mitogen-activated protein kinase 14
(Homo sapiens (Human))
BDBM50374628
(CHEMBL271131)
Show SMILES COc1cc(Nc2ncnc(n2)-n2c(Nc3ccccc3)nc3ccccc23)cc(OC)c1OC
Show InChI InChI=1S/C25H23N7O3/c1-33-20-13-17(14-21(34-2)22(20)35-3)28-23-26-15-27-24(31-23)32-19-12-8-7-11-18(19)30-25(32)29-16-9-5-4-6-10-16/h4-15H,1-3H3,(H,29,30)(H,26,27,28,31)
NCI pathway
Reactome pathway
n/an/a 463n/an/an/an/an/an/a
Amgen Inc.
Curated by ChEMBL
Assay Description
Inhibition of p38-alpha by HTRF assay
J Med Chem 51: 1637-48 (2008)
Article DOI: 10.1021/jm701095m
BindingDB Entry DOI: 10.7270/Q23B6114