BDBM50374635 CHEMBL257922
SMILES: CCOC(C)O[C@H]1C[C@@H](C(=O)OC)[C@]2(C)CC[C@H]3C(=O)O[C@@H](C[C@]3(C)[C@H]2C1=O)c1ccoc1
InChI Key: InChIKey=CJCCEOMVGVWFDI-VGQJWJISSA-N
Data: 3 KI  1 EC50
Activity Spreadsheet -- Enzyme Inhibition Constant Data from BindingDB
Found 4 hits for monomerid = 50374635
Trg + Lig
Ki
nM
ΔG°
kcal/mole
IC50
nM
Kd
nM
EC50/IC50
nM
koff
s-1
kon
M-1s-1
pHTemp
°C
Kappa-type opioid receptor
(Homo sapiens (Human))
BDBM50374635
(CHEMBL257922)
Show SMILES CCOC(C)O[C@H]1C[C@@H](C(=O)OC)[C@]2(C)CC[C@H]3C(=O)O[C@@H](C[C@]3(C)[C@H]2C1=O)c1ccoc1 |w:3.3|
Show InChI InChI=1S/C25H34O8/c1-6-31-14(2)32-18-11-17(22(27)29-5)24(3)9-7-16-23(28)33-19(15-8-10-30-13-15)12-25(16,4)21(24)20(18)26/h8,10,13-14,16-19,21H,6-7,9,11-12H2,1-5H3/t14?,16-,17-,18-,19-,21-,24-,25-/m0/s1
Reactome pathway
11n/an/an/an/an/an/an/an/a
McLean Hospital
Curated by ChEMBL
Assay Description
Displacement of [3H]diprenorphine from human kappa opioid receptor expressed in CHO cells
Bioorg Med Chem 16: 1279-86 (2008)
Article DOI: 10.1016/j.bmc.2007.10.067
BindingDB Entry DOI: 10.7270/Q2ZK5HJF
Delta-type opioid receptor
(MOUSE)
BDBM50374635
(CHEMBL257922)
Show SMILES CCOC(C)O[C@H]1C[C@@H](C(=O)OC)[C@]2(C)CC[C@H]3C(=O)O[C@@H](C[C@]3(C)[C@H]2C1=O)c1ccoc1 |w:3.3|
Show InChI InChI=1S/C25H34O8/c1-6-31-14(2)32-18-11-17(22(27)29-5)24(3)9-7-16-23(28)33-19(15-8-10-30-13-15)12-25(16,4)21(24)20(18)26/h8,10,13-14,16-19,21H,6-7,9,11-12H2,1-5H3/t14?,16-,17-,18-,19-,21-,24-,25-/m0/s1
Reactome pathway
>1.00E+3n/an/an/an/an/an/an/an/a
McLean Hospital
Curated by ChEMBL
Assay Description
Displacement of [3H]diprenorphine from mouse delta opioid receptor expressed in CHO cells
Bioorg Med Chem 16: 1279-86 (2008)
Article DOI: 10.1016/j.bmc.2007.10.067
BindingDB Entry DOI: 10.7270/Q2ZK5HJF
Mu-type opioid receptor
(Rattus norvegicus (rat))
BDBM50374635
(CHEMBL257922)
Show SMILES CCOC(C)O[C@H]1C[C@@H](C(=O)OC)[C@]2(C)CC[C@H]3C(=O)O[C@@H](C[C@]3(C)[C@H]2C1=O)c1ccoc1 |w:3.3|
Show InChI InChI=1S/C25H34O8/c1-6-31-14(2)32-18-11-17(22(27)29-5)24(3)9-7-16-23(28)33-19(15-8-10-30-13-15)12-25(16,4)21(24)20(18)26/h8,10,13-14,16-19,21H,6-7,9,11-12H2,1-5H3/t14?,16-,17-,18-,19-,21-,24-,25-/m0/s1
Reactome pathway
>1.00E+3n/an/an/an/an/an/an/an/a
McLean Hospital
Curated by ChEMBL
Assay Description
Displacement of [3H]diprenorphine from rat mu opioid receptor expressed in CHO cells
Bioorg Med Chem 16: 1279-86 (2008)
Article DOI: 10.1016/j.bmc.2007.10.067
BindingDB Entry DOI: 10.7270/Q2ZK5HJF
Kappa-type opioid receptor
(Homo sapiens (Human))
BDBM50374635
(CHEMBL257922)
Show SMILES CCOC(C)O[C@H]1C[C@@H](C(=O)OC)[C@]2(C)CC[C@H]3C(=O)O[C@@H](C[C@]3(C)[C@H]2C1=O)c1ccoc1 |w:3.3|
Show InChI InChI=1S/C25H34O8/c1-6-31-14(2)32-18-11-17(22(27)29-5)24(3)9-7-16-23(28)33-19(15-8-10-30-13-15)12-25(16,4)21(24)20(18)26/h8,10,13-14,16-19,21H,6-7,9,11-12H2,1-5H3/t14?,16-,17-,18-,19-,21-,24-,25-/m0/s1
Reactome pathway
n/an/an/an/a 10n/an/an/an/a
McLean Hospital
Curated by ChEMBL
Assay Description
Agonist activity at human kappa opioid receptor expressed in CHO cells assessed as stimulation of [35S]GTPgammaS binding
Bioorg Med Chem 16: 1279-86 (2008)
Article DOI: 10.1016/j.bmc.2007.10.067
BindingDB Entry DOI: 10.7270/Q2ZK5HJF