null
SMILES: N[C@@H](CCCNC(=N)N(N)CC(F)(F)F)C(O)=O
InChI Key: InChIKey=WBINKQPTNWLYTD-YFKPBYRVSA-N
Activity Spreadsheet -- Enzyme Inhibition Constant Data from BindingDB
Found 2 hits for monomerid = 50374675
Trg + Lig
Ki
nM
ΔG°
kcal/mole
IC50
nM
Kd
nM
EC50/IC50
nM
koff
s-1
kon
M-1s-1
pHTemp
°C
Nitric oxide synthase, inducible
(Homo sapiens (Human))
BDBM50374675
(CHEMBL272851)
Show SMILES N[C@@H](CCCNC(=N)N(N)CC(F)(F)F)C(O)=O
Show InChI InChI=1S/C8H16F3N5O2/c9-8(10,11)4-16(14)7(13)15-3-1-2-5(12)6(17)18/h5H,1-4,12,14H2,(H2,13,15)(H,17,18)/t5-/m0/s1
NCI pathway
Reactome pathway
1.05E+4n/an/an/an/an/an/an/an/a
University of California
Curated by ChEMBL
Assay Description
Inhibition of full length iNOS by high-throughput oxymyoglobin assay
J Med Chem 51: 924-31 (2008)
Article DOI: 10.1021/jm701119v
BindingDB Entry DOI: 10.7270/Q2639QMP
Nitric oxide synthase, inducible
(Homo sapiens (Human))
BDBM50374675
(CHEMBL272851)
Show SMILES N[C@@H](CCCNC(=N)N(N)CC(F)(F)F)C(O)=O
Show InChI InChI=1S/C8H16F3N5O2/c9-8(10,11)4-16(14)7(13)15-3-1-2-5(12)6(17)18/h5H,1-4,12,14H2,(H2,13,15)(H,17,18)/t5-/m0/s1
NCI pathway
Reactome pathway
n/an/an/a 4.04E+4n/an/an/an/an/a
University of California
Curated by ChEMBL
Assay Description
Binding affinity to truncated iNOS construct (1-490) by spectral assay
J Med Chem 51: 924-31 (2008)
Article DOI: 10.1021/jm701119v
BindingDB Entry DOI: 10.7270/Q2639QMP