null
SMILES: CC1CNC(=O)c2cc3ccc(cc3n12)C(=O)Nc1nc(cs1)C(=O)NC1CCN(C)CC1
InChI Key: InChIKey=DZCMVCGUUJNMQE-UHFFFAOYSA-N
Activity Spreadsheet -- Enzyme Inhibition Constant Data from BindingDB
Found 1 hit for monomerid = 50374693
Trg + Lig
Ki
nM
ΔG°
kcal/mole
IC50
nM
Kd
nM
EC50/IC50
nM
koff
s-1
kon
M-1s-1
pHTemp
°C
MAP kinase-activated protein kinase 2
(Homo sapiens (Human))
BDBM50374693
(CHEMBL271309)
Show SMILES CC1CNC(=O)c2cc3ccc(cc3n12)C(=O)Nc1nc(cs1)C(=O)NC1CCN(C)CC1 |w:1.0|
Show InChI InChI=1S/C23H26N6O3S/c1-13-11-24-22(32)19-9-14-3-4-15(10-18(14)29(13)19)20(30)27-23-26-17(12-33-23)21(31)25-16-5-7-28(2)8-6-16/h3-4,9-10,12-13,16H,5-8,11H2,1-2H3,(H,24,32)(H,25,31)(H,26,27,30)
NCI pathway
Reactome pathway
n/an/a 5n/an/an/an/an/an/a
Boehringer Ingelheim Pharmaceuticals
Curated by ChEMBL
Assay Description
Inhibition of MK2
Bioorg Med Chem Lett 18: 938-41 (2008)
Article DOI: 10.1016/j.bmcl.2007.12.037
BindingDB Entry DOI: 10.7270/Q22B8ZWZ