BDBM50374726 CHEMBL259367
SMILES: COc1ccc2C(CCCN3CCc4cc(OC)c(OC)cc4C3)CCCc2c1
InChI Key: InChIKey=HJBMLYTXOFQZDS-UHFFFAOYSA-N
Data: 1 EC50
Activity Spreadsheet -- Enzyme Inhibition Constant Data from BindingDB
Found 1 hit for monomerid = 50374726
Trg + Lig
Ki
nM
ΔG°
kcal/mole
IC50
nM
Kd
nM
EC50/IC50
nM
koff
s-1
kon
M-1s-1
pHTemp
°C
P-glycoprotein 1
(Homo sapiens (Human))
BDBM50374726
(CHEMBL259367)
Show SMILES COc1ccc2C(CCCN3CCc4cc(OC)c(OC)cc4C3)CCCc2c1 |w:6.6|
Show InChI InChI=1S/C25H33NO3/c1-27-22-9-10-23-18(6-4-7-20(23)14-22)8-5-12-26-13-11-19-15-24(28-2)25(29-3)16-21(19)17-26/h9-10,14-16,18H,4-8,11-13,17H2,1-3H3
n/an/an/an/a 8.15E+3n/an/an/an/a
Universit£ degli Studi di Bari
Curated by ChEMBL
Assay Description
Inhibition of human Pgp mediated [3H]vinblastine transport in human Caco-2 cells
Bioorg Med Chem 16: 362-73 (2008)
Article DOI: 10.1016/j.bmc.2007.09.039
BindingDB Entry DOI: 10.7270/Q2ST7QQS