BDBM50374728 CHEMBL415560
SMILES: COc1cc2CCN(CCCC3=CCCc4c(OC)cccc34)Cc2cc1OC
InChI Key: InChIKey=BKLBMMUVHQYDCN-UHFFFAOYSA-N
Data: 1 EC50
Activity Spreadsheet -- Enzyme Inhibition Constant Data from BindingDB
Found 1 hit for monomerid = 50374728
Trg + Lig
Ki
nM
ΔG°
kcal/mole
IC50
nM
Kd
nM
EC50/IC50
nM
koff
s-1
kon
M-1s-1
pHTemp
°C
P-glycoprotein 1
(Homo sapiens (Human))
BDBM50374728
(CHEMBL415560)
Show SMILES COc1cc2CCN(CCCC3=CCCc4c(OC)cccc34)Cc2cc1OC |t:11|
Show InChI InChI=1S/C25H31NO3/c1-27-23-11-5-9-21-18(7-4-10-22(21)23)8-6-13-26-14-12-19-15-24(28-2)25(29-3)16-20(19)17-26/h5,7,9,11,15-16H,4,6,8,10,12-14,17H2,1-3H3
n/an/an/an/a 1.50E+4n/an/an/an/a
Universit£ degli Studi di Bari
Curated by ChEMBL
Assay Description
Inhibition of human Pgp mediated [3H]vinblastine transport in human Caco-2 cells
Bioorg Med Chem 16: 362-73 (2008)
Article DOI: 10.1016/j.bmc.2007.09.039
BindingDB Entry DOI: 10.7270/Q2ST7QQS