BDBM50374923 CHEMBL255561
SMILES: O=C1NC(=O)\C(=C\c2ccccc2)C(=O)N1c1ccccc1
InChI Key: InChIKey=ZSWFJWXHZHNSHE-KAMYIIQDSA-N
Data: 1 IC50
Activity Spreadsheet -- Enzyme Inhibition Constant Data from BindingDB
Found 1 hit for monomerid = 50374923
Trg + Lig
Ki
nM
ΔG°
kcal/mole
IC50
nM
Kd
nM
EC50/IC50
nM
koff
s-1
kon
M-1s-1
pHTemp
°C
Integrin alpha4beta7
(Homo sapiens (Human))
BDBM50374923
(CHEMBL255561)
Show SMILES O=C1NC(=O)\C(=C\c2ccccc2)C(=O)N1c1ccccc1
Show InChI InChI=1S/C17H12N2O3/c20-15-14(11-12-7-3-1-4-8-12)16(21)19(17(22)18-15)13-9-5-2-6-10-13/h1-11H,(H,18,20,22)/b14-11-
n/an/a 2.20E+3n/an/an/an/an/an/a
Millennium Pharmaceuticals
Curated by ChEMBL
Assay Description
Inhibition of human integrin alpha-4-beta-7-MAdCAM interaction in human RPMI 8866 cells by whole-cell adhesion assay
Bioorg Med Chem Lett 18: 2509-12 (2008)
Article DOI: 10.1016/j.bmcl.2007.07.068
BindingDB Entry DOI: 10.7270/Q2N58N8Q