BDBM50375149 CHEMBL272117
SMILES: CN1CCN(CC1)c1ccc(Nc2ncc3c(n2)n(cc(C(N)=O)c3=O)C2CCCC2)cc1
InChI Key: InChIKey=WHBVVZPDEFKMLP-UHFFFAOYSA-N
Data: 1 IC50
Activity Spreadsheet -- Enzyme Inhibition Constant Data from BindingDB
Found 1 hit for monomerid = 50375149
Trg + Lig
Ki
nM
ΔG°
kcal/mole
IC50
nM
Kd
nM
EC50/IC50
nM
koff
s-1
kon
M-1s-1
pHTemp
°C
Macrophage colony stimulating factor receptor
(Homo sapiens (Human))
BDBM50375149
(CHEMBL272117)
Show SMILES CN1CCN(CC1)c1ccc(Nc2ncc3c(n2)n(cc(C(N)=O)c3=O)C2CCCC2)cc1
Show InChI InChI=1S/C24H29N7O2/c1-29-10-12-30(13-11-29)17-8-6-16(7-9-17)27-24-26-14-19-21(32)20(22(25)33)15-31(23(19)28-24)18-4-2-3-5-18/h6-9,14-15,18H,2-5,10-13H2,1H3,(H2,25,33)(H,26,27,28)
n/an/a 56n/an/an/an/an/an/a
Johnson& Johnson Pharmaceutical Research& Development
Curated by ChEMBL
Assay Description
Inhibition of ATP-induced CSF1R autophosphorylation
Bioorg Med Chem Lett 18: 2355-61 (2008)
Article DOI: 10.1016/j.bmcl.2008.02.070
BindingDB Entry DOI: 10.7270/Q26W9BX3