BDBM50375151 CHEMBL255181
SMILES: CCNC(=O)c1cn(-c2ccc3CCCc3c2)c2nc(Nc3ccc(cc3)N3CCN(C)CC3)ncc2c1=O
InChI Key: InChIKey=NKVOKKOMBNOQAR-UHFFFAOYSA-N
Data: 1 IC50
Activity Spreadsheet -- Enzyme Inhibition Constant Data from BindingDB
Found 1 hit for monomerid = 50375151
Trg + Lig
Ki
nM
ΔG°
kcal/mole
IC50
nM
Kd
nM
EC50/IC50
nM
koff
s-1
kon
M-1s-1
pHTemp
°C
Macrophage colony stimulating factor receptor
(Homo sapiens (Human))
BDBM50375151
(CHEMBL255181)
Show SMILES CCNC(=O)c1cn(-c2ccc3CCCc3c2)c2nc(Nc3ccc(cc3)N3CCN(C)CC3)ncc2c1=O
Show InChI InChI=1S/C30H33N7O2/c1-3-31-29(39)26-19-37(24-10-7-20-5-4-6-21(20)17-24)28-25(27(26)38)18-32-30(34-28)33-22-8-11-23(12-9-22)36-15-13-35(2)14-16-36/h7-12,17-19H,3-6,13-16H2,1-2H3,(H,31,39)(H,32,33,34)
n/an/a 68n/an/an/an/an/an/a
Johnson& Johnson Pharmaceutical Research& Development
Curated by ChEMBL
Assay Description
Inhibition of ATP-induced CSF1R autophosphorylation
Bioorg Med Chem Lett 18: 2355-61 (2008)
Article DOI: 10.1016/j.bmcl.2008.02.070
BindingDB Entry DOI: 10.7270/Q26W9BX3