BDBM50375167 CHEMBL270356
SMILES: [#6]-[#8]-c1ccc(\[#6]=[#6]-2/[#6](=O)-[#7]-[#6](=O)-[#7]-[#6]-2=O)cc1
InChI Key: InChIKey=IWKTUKNFSHWMNP-UHFFFAOYSA-N
Data: 1 KI  1 IC50
Activity Spreadsheet -- Enzyme Inhibition Constant Data from BindingDB
Found 2 hits for monomerid = 50375167
Trg + Lig
Ki
nM
ΔG°
kcal/mole
IC50
nM
Kd
nM
EC50/IC50
nM
koff
s-1
kon
M-1s-1
pHTemp
°C
Methionine Aminopeptidase Type 1 (MetAP1)
(Homo sapiens (Human))
BDBM50375167
(CHEMBL270356)
Show SMILES [#6]-[#8]-c1ccc(\[#6]=[#6]-2/[#6](=O)-[#7]-[#6](=O)-[#7]-[#6]-2=O)cc1
Show InChI InChI=1S/C12H10N2O4/c1-18-8-4-2-7(3-5-8)6-9-10(15)13-12(17)14-11(9)16/h2-6H,1H3,(H2,13,14,15,16,17)
Reactome pathway
2.00E+3n/an/an/an/an/an/an/an/a
North Dakota State University
Curated by ChEMBL
Assay Description
Inhibition of human methionine aminopeptidase 1
Bioorg Med Chem Lett 18: 2373-6 (2008)
Article DOI: 10.1016/j.bmcl.2008.02.066
BindingDB Entry DOI: 10.7270/Q2348M7J
Tyrosinase
(Agaricus bisporus (Common mushroom))
BDBM50375167
(CHEMBL270356)
Show SMILES [#6]-[#8]-c1ccc(\[#6]=[#6]-2/[#6](=O)-[#7]-[#6](=O)-[#7]-[#6]-2=O)cc1
Show InChI InChI=1S/C12H10N2O4/c1-18-8-4-2-7(3-5-8)6-9-10(15)13-12(17)14-11(9)16/h2-6H,1H3,(H2,13,14,15,16,17)
n/an/a 1.00E+5n/an/an/an/an/an/a
China National Analytical Center (Guangzhou)
Curated by ChEMBL
Assay Description
Inhibition of mushroom tyrosinase diphenolase activity using L-DOPA as substrate assessed as formation of DOPAchrome preincubated for 10 mins followe...
Bioorg Med Chem 22: 3279-84 (2014)
Article DOI: 10.1016/j.bmc.2014.04.060
BindingDB Entry DOI: 10.7270/Q2FB55WQ