BDBM50375218 CHEMBL557376
SMILES: CCCN(CCc1ccc(F)c(F)c1)CC(O)c1cccnc1
InChI Key: InChIKey=NZEOJFNEIQIKPH-UHFFFAOYSA-N
Data: 1 Kd
Activity Spreadsheet -- Enzyme Inhibition Constant Data from BindingDB
Found 1 hit for monomerid = 50375218
Trg + Lig
Ki
nM
ΔG°
kcal/mole
IC50
nM
Kd
nM
EC50/IC50
nM
koff
s-1
kon
M-1s-1
pHTemp
°C
Lanosterol 14-alpha demethylase
(Homo sapiens (Human))
BDBM50375218
(CHEMBL557376)
Show SMILES CCCN(CCc1ccc(F)c(F)c1)CC(O)c1cccnc1
Show InChI InChI=1S/C18H22F2N2O/c1-2-9-22(13-18(23)15-4-3-8-21-12-15)10-7-14-5-6-16(19)17(20)11-14/h3-6,8,11-12,18,23H,2,7,9-10,13H2,1H3
n/an/an/a 2.70E+4n/an/an/an/an/a
Lek Pharmaceuticals d. d.
Curated by ChEMBL
Assay Description
Binding affinity to human His-tagged CYP51 expressed in Escherichia coli
Bioorg Med Chem 16: 209-21 (2008)
Article DOI: 10.1016/j.bmc.2007.10.001
BindingDB Entry DOI: 10.7270/Q2TQ62DS