BDBM50375311 CHEMBL428079
SMILES: OC1CCN(CC1)C(=O)C1(CCCC1)NC(=O)c1cc2cc(Cl)ccc2[nH]1
InChI Key: InChIKey=SUMHUPSJPVPBRT-UHFFFAOYSA-N
Data: 1 IC50
Activity Spreadsheet -- Enzyme Inhibition Constant Data from BindingDB
Found 1 hit for monomerid = 50375311
Trg + Lig
Ki
nM
ΔG°
kcal/mole
IC50
nM
Kd
nM
EC50/IC50
nM
koff
s-1
kon
M-1s-1
pHTemp
°C
Lanosterol 14-alpha demethylase
(Homo sapiens (Human))
BDBM50375311
(CHEMBL428079)
Show SMILES OC1CCN(CC1)C(=O)C1(CCCC1)NC(=O)c1cc2cc(Cl)ccc2[nH]1
Show InChI InChI=1S/C20H24ClN3O3/c21-14-3-4-16-13(11-14)12-17(22-16)18(26)23-20(7-1-2-8-20)19(27)24-9-5-15(25)6-10-24/h3-4,11-12,15,22,25H,1-2,5-10H2,(H,23,26)
n/an/a 1.00E+5n/an/an/an/an/an/a
ACT LLC
Curated by ChEMBL
Assay Description
Inhibition of human CYP51 expressed in Topp 3 cells by lanosterol demethylase assay
Drug Metab Dispos 35: 493-500 (2007)
Article DOI: 10.1124/dmd.106.013888
BindingDB Entry DOI: 10.7270/Q2DF6S2H