BDBM50375329 CHEMBL427907
SMILES: O=c1[nH]ccn2c(nc(-c3ccc4ccc(nc4c3)-c3ccccc3)c12)C1CCC1
InChI Key: InChIKey=KMBNBWQPFLAEHE-UHFFFAOYSA-N
Data: 1 IC50
Activity Spreadsheet -- Enzyme Inhibition Constant Data from BindingDB
Found 1 hit for monomerid = 50375329
Trg + Lig
Ki
nM
ΔG°
kcal/mole
IC50
nM
Kd
nM
EC50/IC50
nM
koff
s-1
kon
M-1s-1
pHTemp
°C
Insulin-like growth factor I receptor
(Homo sapiens (Human))
BDBM50375329
(CHEMBL427907)
Show SMILES O=c1[nH]ccn2c(nc(-c3ccc4ccc(nc4c3)-c3ccccc3)c12)C1CCC1
Show InChI InChI=1S/C25H20N4O/c30-25-23-22(28-24(18-7-4-8-18)29(23)14-13-26-25)19-10-9-17-11-12-20(27-21(17)15-19)16-5-2-1-3-6-16/h1-3,5-6,9-15,18H,4,7-8H2,(H,26,30)
Reactome pathway
n/an/a>1.00E+4n/an/an/an/an/an/a
OSI Pharmaceuticals, Inc.
Curated by ChEMBL
Assay Description
Inhibition of human recombinant full length IGF1R expressed in mouse 3T3 cells
Bioorg Med Chem 16: 1359-75 (2008)
Article DOI: 10.1016/j.bmc.2007.10.061
BindingDB Entry DOI: 10.7270/Q2WH2QVH