BDBM50375391 CHEMBL256696
SMILES: CC(C)(C)c1nn(CC2CC2)\c(=N\C(=O)c2cccc(c2)C(F)(F)F)s1
InChI Key: InChIKey=NSEXFUFRRQQQFH-JWGURIENSA-N
Data: 1 IC50
Activity Spreadsheet -- Enzyme Inhibition Constant Data from BindingDB
Found 1 hit for monomerid = 50375391
Trg + Lig
Ki
nM
ΔG°
kcal/mole
IC50
nM
Kd
nM
EC50/IC50
nM
koff
s-1
kon
M-1s-1
pHTemp
°C
Cannabinoid receptor 2
(Homo sapiens (Human))
BDBM50375391
(CHEMBL256696)
Show SMILES CC(C)(C)c1nn(CC2CC2)\c(=N\C(=O)c2cccc(c2)C(F)(F)F)s1
Show InChI InChI=1S/C18H20F3N3OS/c1-17(2,3)15-23-24(10-11-7-8-11)16(26-15)22-14(25)12-5-4-6-13(9-12)18(19,20)21/h4-6,9,11H,7-8,10H2,1-3H3/b22-16-
Reactome pathway
n/an/a 300n/an/an/an/an/an/a
Taisho Pharmaceutical Co., Ltd
Curated by ChEMBL
Assay Description
Displacement of [3H]CP-55940 from human recombinant CB2 receptor expressed in CHO cells
Bioorg Med Chem 16: 1111-24 (2008)
Article DOI: 10.1016/j.bmc.2007.10.087
BindingDB Entry DOI: 10.7270/Q208665C