null
SMILES: Cc1cc(O)cc(C)c1C[C@H](N)C(=O)N1Cc2ccccc2C[C@@H]1C(=O)N[C@@H](Cc1ccccc1)C(=O)N[C@@H](CCCCNC(=O)c1ccc(F)cc1)C(O)=O
InChI Key: InChIKey=WCPSDLOTJZKOSW-IZBQCXFTSA-N
Activity Spreadsheet -- Enzyme Inhibition Constant Data from BindingDB
Found 4 hits for monomerid = 50375696
Trg + Lig
Ki
nM
ΔG°
kcal/mole
IC50
nM
Kd
nM
EC50/IC50
nM
koff
s-1
kon
M-1s-1
pHTemp
°C
Delta-type opioid receptor
(Rattus norvegicus (rat))
BDBM50375696
(CHEMBL269842)
Show SMILES Cc1cc(O)cc(C)c1C[C@H](N)C(=O)N1Cc2ccccc2C[C@@H]1C(=O)N[C@@H](Cc1ccccc1)C(=O)N[C@@H](CCCCNC(=O)c1ccc(F)cc1)C(O)=O
Show InChI InChI=1S/C43H48FN5O7/c1-26-20-33(50)21-27(2)34(26)24-35(45)42(54)49-25-31-13-7-6-12-30(31)23-38(49)41(53)48-37(22-28-10-4-3-5-11-28)40(52)47-36(43(55)56)14-8-9-19-46-39(51)29-15-17-32(44)18-16-29/h3-7,10-13,15-18,20-21,35-38,50H,8-9,14,19,22-25,45H2,1-2H3,(H,46,51)(H,47,52)(H,48,53)(H,55,56)/t35-,36-,37-,38+/m0/s1
Reactome pathway
0.248n/an/an/an/an/an/an/an/a
Stanford University School of Medicine
Curated by ChEMBL
Assay Description
Displacement of [3H]deltorphin2 from delta opioid receptor in Sprague-Dawley rat brain P2 synaptosomal membrane
J Med Chem 51: 1817-23 (2008)
Article DOI: 10.1021/jm7014765
BindingDB Entry DOI: 10.7270/Q24T6K7K
Mu-type opioid receptor
(Rattus norvegicus (rat))
BDBM50375696
(CHEMBL269842)
Show SMILES Cc1cc(O)cc(C)c1C[C@H](N)C(=O)N1Cc2ccccc2C[C@@H]1C(=O)N[C@@H](Cc1ccccc1)C(=O)N[C@@H](CCCCNC(=O)c1ccc(F)cc1)C(O)=O
Show InChI InChI=1S/C43H48FN5O7/c1-26-20-33(50)21-27(2)34(26)24-35(45)42(54)49-25-31-13-7-6-12-30(31)23-38(49)41(53)48-37(22-28-10-4-3-5-11-28)40(52)47-36(43(55)56)14-8-9-19-46-39(51)29-15-17-32(44)18-16-29/h3-7,10-13,15-18,20-21,35-38,50H,8-9,14,19,22-25,45H2,1-2H3,(H,46,51)(H,47,52)(H,48,53)(H,55,56)/t35-,36-,37-,38+/m0/s1
Reactome pathway
13.2n/an/an/an/an/an/an/an/a
Stanford University School of Medicine
Curated by ChEMBL
Assay Description
Displacement of [3H]DAMGO from mu opioid receptor in Sprague-Dawley rat brain P2 synaptosomal membrane
J Med Chem 51: 1817-23 (2008)
Article DOI: 10.1021/jm7014765
BindingDB Entry DOI: 10.7270/Q24T6K7K
Delta-type opioid receptor
(MOUSE)
BDBM50375696
(CHEMBL269842)
Show SMILES Cc1cc(O)cc(C)c1C[C@H](N)C(=O)N1Cc2ccccc2C[C@@H]1C(=O)N[C@@H](Cc1ccccc1)C(=O)N[C@@H](CCCCNC(=O)c1ccc(F)cc1)C(O)=O
Show InChI InChI=1S/C43H48FN5O7/c1-26-20-33(50)21-27(2)34(26)24-35(45)42(54)49-25-31-13-7-6-12-30(31)23-38(49)41(53)48-37(22-28-10-4-3-5-11-28)40(52)47-36(43(55)56)14-8-9-19-46-39(51)29-15-17-32(44)18-16-29/h3-7,10-13,15-18,20-21,35-38,50H,8-9,14,19,22-25,45H2,1-2H3,(H,46,51)(H,47,52)(H,48,53)(H,55,56)/t35-,36-,37-,38+/m0/s1
Reactome pathway
n/an/a 5.18E+3n/an/an/an/an/an/a
Stanford University School of Medicine
Curated by ChEMBL
Assay Description
Agonist activity at delta opioid receptor in mouse vas deferens assessed as inhibition of electrically evoked-contraction
J Med Chem 51: 1817-23 (2008)
Article DOI: 10.1021/jm7014765
BindingDB Entry DOI: 10.7270/Q24T6K7K
Mu-type opioid receptor
(GUINEA PIG)
BDBM50375696
(CHEMBL269842)
Show SMILES Cc1cc(O)cc(C)c1C[C@H](N)C(=O)N1Cc2ccccc2C[C@@H]1C(=O)N[C@@H](Cc1ccccc1)C(=O)N[C@@H](CCCCNC(=O)c1ccc(F)cc1)C(O)=O
Show InChI InChI=1S/C43H48FN5O7/c1-26-20-33(50)21-27(2)34(26)24-35(45)42(54)49-25-31-13-7-6-12-30(31)23-38(49)41(53)48-37(22-28-10-4-3-5-11-28)40(52)47-36(43(55)56)14-8-9-19-46-39(51)29-15-17-32(44)18-16-29/h3-7,10-13,15-18,20-21,35-38,50H,8-9,14,19,22-25,45H2,1-2H3,(H,46,51)(H,47,52)(H,48,53)(H,55,56)/t35-,36-,37-,38+/m0/s1
n/an/a 50.6n/an/an/an/an/an/a
Stanford University School of Medicine
Curated by ChEMBL
Assay Description
Agonist activity at mu opioid receptor in Hartley guinea pig assessed as inhibition of electrically evoked-contraction
J Med Chem 51: 1817-23 (2008)
Article DOI: 10.1021/jm7014765
BindingDB Entry DOI: 10.7270/Q24T6K7K