BDBM50375732 CHEMBL271290
SMILES: Cc1ccc(CN2CC[C@H](C2)NC(=O)CNC(=O)c2cc(ccc2N)C(F)(F)F)cc1
InChI Key: InChIKey=IBDJHIUJBNHQLW-QGZVFWFLSA-N
Data: 2 IC50
Activity Spreadsheet -- Enzyme Inhibition Constant Data from BindingDB
Found 2 hits for monomerid = 50375732
Trg + Lig
Ki
nM
ΔG°
kcal/mole
IC50
nM
Kd
nM
EC50/IC50
nM
koff
s-1
kon
M-1s-1
pHTemp
°C
C-C chemokine receptor type 2
(Homo sapiens (Human))
BDBM50375732
(CHEMBL271290)
Show SMILES Cc1ccc(CN2CC[C@H](C2)NC(=O)CNC(=O)c2cc(ccc2N)C(F)(F)F)cc1
Show InChI InChI=1S/C22H25F3N4O2/c1-14-2-4-15(5-3-14)12-29-9-8-17(13-29)28-20(30)11-27-21(31)18-10-16(22(23,24)25)6-7-19(18)26/h2-7,10,17H,8-9,11-13,26H2,1H3,(H,27,31)(H,28,30)/t17-/m1/s1
n/an/a 20n/an/an/an/an/an/a
Deltagen Research Laboratories (Former CombiChem, Inc.
Curated by ChEMBL
Assay Description
Displacement of [125I]MCP1 from human CCR2b in THP1 cells
Bioorg Med Chem Lett 18: 1869-73 (2008)
Article DOI: 10.1016/j.bmcl.2008.02.015
BindingDB Entry DOI: 10.7270/Q2W95B2Q
C-C chemokine receptor type 2
(Homo sapiens (Human))
BDBM50375732
(CHEMBL271290)
Show SMILES Cc1ccc(CN2CC[C@H](C2)NC(=O)CNC(=O)c2cc(ccc2N)C(F)(F)F)cc1
Show InChI InChI=1S/C22H25F3N4O2/c1-14-2-4-15(5-3-14)12-29-9-8-17(13-29)28-20(30)11-27-21(31)18-10-16(22(23,24)25)6-7-19(18)26/h2-7,10,17H,8-9,11-13,26H2,1H3,(H,27,31)(H,28,30)/t17-/m1/s1
n/an/a 3.10n/an/an/an/an/an/a
Deltagen Research Laboratories (Former CombiChem, Inc.
Curated by ChEMBL
Assay Description
Antagonist activity at human CCR2 in THP1 cells assessed as inhibition of MCP1-induced chemotaxis
Bioorg Med Chem Lett 18: 1869-73 (2008)
Article DOI: 10.1016/j.bmcl.2008.02.015
BindingDB Entry DOI: 10.7270/Q2W95B2Q