BDBM50375733 CHEMBL404259
SMILES: Nc1ccc(cc1C(=O)NCC(=O)N[C@@H]1CCN(Cc2ccc(Cl)cc2)C1)C(F)(F)F
InChI Key: InChIKey=BWUJEEUVCAHHTL-MRXNPFEDSA-N
Data: 5 IC50
Activity Spreadsheet -- Enzyme Inhibition Constant Data from BindingDB
Found 5 hits for monomerid = 50375733
Trg + Lig
Ki
nM
ΔG°
kcal/mole
IC50
nM
Kd
nM
EC50/IC50
nM
koff
s-1
kon
M-1s-1
pHTemp
°C
C-C chemokine receptor type 2
(Homo sapiens (Human))
BDBM50375733
(CHEMBL404259)
Show SMILES Nc1ccc(cc1C(=O)NCC(=O)N[C@@H]1CCN(Cc2ccc(Cl)cc2)C1)C(F)(F)F
Show InChI InChI=1S/C21H22ClF3N4O2/c22-15-4-1-13(2-5-15)11-29-8-7-16(12-29)28-19(30)10-27-20(31)17-9-14(21(23,24)25)3-6-18(17)26/h1-6,9,16H,7-8,10-12,26H2,(H,27,31)(H,28,30)/t16-/m1/s1
n/an/a 3.60n/an/an/an/an/an/a
Deltagen Research Laboratories (Former CombiChem, Inc.
Curated by ChEMBL
Assay Description
Antagonist activity at human CCR2 in THP1 cells assessed as inhibition of MCP1-induced chemotaxis
Bioorg Med Chem Lett 18: 1869-73 (2008)
Article DOI: 10.1016/j.bmcl.2008.02.015
BindingDB Entry DOI: 10.7270/Q2W95B2Q
C-C chemokine receptor type 2
(Homo sapiens (Human))
BDBM50375733
(CHEMBL404259)
Show SMILES Nc1ccc(cc1C(=O)NCC(=O)N[C@@H]1CCN(Cc2ccc(Cl)cc2)C1)C(F)(F)F
Show InChI InChI=1S/C21H22ClF3N4O2/c22-15-4-1-13(2-5-15)11-29-8-7-16(12-29)28-19(30)10-27-20(31)17-9-14(21(23,24)25)3-6-18(17)26/h1-6,9,16H,7-8,10-12,26H2,(H,27,31)(H,28,30)/t16-/m1/s1
n/an/a 23.1n/an/an/an/an/an/a
Deltagen Research Laboratories (Former CombiChem, Inc.
Curated by ChEMBL
Assay Description
Antagonist activity at human CCR2 in THP1 cells assessed as inhibition of MCP1-induced calcium flux
Bioorg Med Chem Lett 18: 1869-73 (2008)
Article DOI: 10.1016/j.bmcl.2008.02.015
BindingDB Entry DOI: 10.7270/Q2W95B2Q
C-C chemokine receptor type 2
(Homo sapiens (Human))
BDBM50375733
(CHEMBL404259)
Show SMILES Nc1ccc(cc1C(=O)NCC(=O)N[C@@H]1CCN(Cc2ccc(Cl)cc2)C1)C(F)(F)F
Show InChI InChI=1S/C21H22ClF3N4O2/c22-15-4-1-13(2-5-15)11-29-8-7-16(12-29)28-19(30)10-27-20(31)17-9-14(21(23,24)25)3-6-18(17)26/h1-6,9,16H,7-8,10-12,26H2,(H,27,31)(H,28,30)/t16-/m1/s1
n/an/a 45n/an/an/an/an/an/a
Deltagen Research Laboratories (Former CombiChem, Inc.
Curated by ChEMBL
Assay Description
Displacement of [125I]MCP1 from human CCR2b in HEK293 cells
Bioorg Med Chem Lett 18: 1869-73 (2008)
Article DOI: 10.1016/j.bmcl.2008.02.015
BindingDB Entry DOI: 10.7270/Q2W95B2Q
C-C chemokine receptor type 2
(Homo sapiens (Human))
BDBM50375733
(CHEMBL404259)
Show SMILES Nc1ccc(cc1C(=O)NCC(=O)N[C@@H]1CCN(Cc2ccc(Cl)cc2)C1)C(F)(F)F
Show InChI InChI=1S/C21H22ClF3N4O2/c22-15-4-1-13(2-5-15)11-29-8-7-16(12-29)28-19(30)10-27-20(31)17-9-14(21(23,24)25)3-6-18(17)26/h1-6,9,16H,7-8,10-12,26H2,(H,27,31)(H,28,30)/t16-/m1/s1
n/an/a 26n/an/an/an/an/an/a
Deltagen Research Laboratories (Former CombiChem, Inc.
Curated by ChEMBL
Assay Description
Displacement of [125I]MCP1 from human CCR2b in THP1 cells
Bioorg Med Chem Lett 18: 1869-73 (2008)
Article DOI: 10.1016/j.bmcl.2008.02.015
BindingDB Entry DOI: 10.7270/Q2W95B2Q
C-C chemokine receptor type 1
(Homo sapiens (Human))
BDBM50375733
(CHEMBL404259)
Show SMILES Nc1ccc(cc1C(=O)NCC(=O)N[C@@H]1CCN(Cc2ccc(Cl)cc2)C1)C(F)(F)F
Show InChI InChI=1S/C21H22ClF3N4O2/c22-15-4-1-13(2-5-15)11-29-8-7-16(12-29)28-19(30)10-27-20(31)17-9-14(21(23,24)25)3-6-18(17)26/h1-6,9,16H,7-8,10-12,26H2,(H,27,31)(H,28,30)/t16-/m1/s1
Reactome pathway
n/an/a>1.00E+3n/an/an/an/an/an/a
Deltagen Research Laboratories (Former CombiChem, Inc.
Curated by ChEMBL
Assay Description
Displacement of [125I]MCP1-alpha from human CCR1 in THP cells
Bioorg Med Chem Lett 18: 1869-73 (2008)
Article DOI: 10.1016/j.bmcl.2008.02.015
BindingDB Entry DOI: 10.7270/Q2W95B2Q