BDBM50375797 CHEMBL269792
SMILES: C[C@H](N)C(=O)NCCOc1cc(-c2ccccc2Cl)c2ccc(=O)n(-c3c(Cl)cccc3Cl)c2c1
InChI Key: InChIKey=ASQPNMCVHWLECS-HNNXBMFYSA-N
Data: 2 IC50
Activity Spreadsheet -- Enzyme Inhibition Constant Data from BindingDB
Found 2 hits for monomerid = 50375797
Trg + Lig
Ki
nM
ΔG°
kcal/mole
IC50
nM
Kd
nM
EC50/IC50
nM
koff
s-1
kon
M-1s-1
pHTemp
°C
Mitogen-activated protein kinase 14
(Homo sapiens (Human))
BDBM50375797
(CHEMBL269792)
Show SMILES C[C@H](N)C(=O)NCCOc1cc(-c2ccccc2Cl)c2ccc(=O)n(-c3c(Cl)cccc3Cl)c2c1 |wU:1.1,(30.05,-2.81,;29.98,-1.26,;31.21,-.38,;28.7,-.38,;27.45,-1.31,;28.66,1.16,;27.32,1.9,;25.99,1.11,;24.65,1.86,;23.33,1.07,;23.35,-.48,;22.03,-1.26,;22.05,-2.8,;20.72,-3.59,;20.74,-5.13,;22.09,-5.88,;23.42,-5.09,;23.39,-3.55,;24.71,-2.76,;20.69,-.51,;19.37,-1.3,;18.03,-.55,;18.01,.99,;16.67,1.74,;19.33,1.79,;19.31,3.33,;17.98,4.08,;16.65,3.29,;17.95,5.61,;19.28,6.41,;20.63,5.66,;20.65,4.12,;21.99,3.36,;20.67,1.03,;21.99,1.81,)|
Show InChI InChI=1S/C26H22Cl3N3O3/c1-15(30)26(34)31-11-12-35-16-13-19(17-5-2-3-6-20(17)27)18-9-10-24(33)32(23(18)14-16)25-21(28)7-4-8-22(25)29/h2-10,13-15H,11-12,30H2,1H3,(H,31,34)/t15-/m0/s1
NCI pathway
Reactome pathway
n/an/a 0.160n/an/an/an/an/an/a
Merck Research Laboratories
Curated by ChEMBL
Assay Description
Inhibition of p38alpha
Bioorg Med Chem Lett 18: 2222-6 (2008)
Article DOI: 10.1016/j.bmcl.2006.10.097
BindingDB Entry DOI: 10.7270/Q23T9J36
Mitogen-activated protein kinase 14
(Homo sapiens (Human))
BDBM50375797
(CHEMBL269792)
Show SMILES C[C@H](N)C(=O)NCCOc1cc(-c2ccccc2Cl)c2ccc(=O)n(-c3c(Cl)cccc3Cl)c2c1 |wU:1.1,(30.05,-2.81,;29.98,-1.26,;31.21,-.38,;28.7,-.38,;27.45,-1.31,;28.66,1.16,;27.32,1.9,;25.99,1.11,;24.65,1.86,;23.33,1.07,;23.35,-.48,;22.03,-1.26,;22.05,-2.8,;20.72,-3.59,;20.74,-5.13,;22.09,-5.88,;23.42,-5.09,;23.39,-3.55,;24.71,-2.76,;20.69,-.51,;19.37,-1.3,;18.03,-.55,;18.01,.99,;16.67,1.74,;19.33,1.79,;19.31,3.33,;17.98,4.08,;16.65,3.29,;17.95,5.61,;19.28,6.41,;20.63,5.66,;20.65,4.12,;21.99,3.36,;20.67,1.03,;21.99,1.81,)|
Show InChI InChI=1S/C26H22Cl3N3O3/c1-15(30)26(34)31-11-12-35-16-13-19(17-5-2-3-6-20(17)27)18-9-10-24(33)32(23(18)14-16)25-21(28)7-4-8-22(25)29/h2-10,13-15H,11-12,30H2,1H3,(H,31,34)/t15-/m0/s1
NCI pathway
Reactome pathway
n/an/a 32n/an/an/an/an/an/a
Merck Research Laboratories
Curated by ChEMBL
Assay Description
Inhibition of p38-alpha by whole blood assay
Bioorg Med Chem Lett 18: 2222-6 (2008)
Article DOI: 10.1016/j.bmcl.2006.10.097
BindingDB Entry DOI: 10.7270/Q23T9J36