BDBM50376038 CHEMBL412291
SMILES: COc1cc2nccc(Oc3ccc4c(cccc4c3)C(=O)Nc3cccc(F)c3)c2cc1OC
InChI Key: InChIKey=SUHHULWGFDPFCX-UHFFFAOYSA-N
Data: 2 IC50
Activity Spreadsheet -- Enzyme Inhibition Constant Data from BindingDB
Found 2 hits for monomerid = 50376038
Trg + Lig
Ki
nM
ΔG°
kcal/mole
IC50
nM
Kd
nM
EC50/IC50
nM
koff
s-1
kon
M-1s-1
pHTemp
°C
Vascular endothelial growth factor receptor 2
(Homo sapiens (Human))
BDBM50376038
(CHEMBL412291)
Show SMILES COc1cc2nccc(Oc3ccc4c(cccc4c3)C(=O)Nc3cccc(F)c3)c2cc1OC
Show InChI InChI=1S/C28H21FN2O4/c1-33-26-15-23-24(16-27(26)34-2)30-12-11-25(23)35-20-9-10-21-17(13-20)5-3-8-22(21)28(32)31-19-7-4-6-18(29)14-19/h3-16H,1-2H3,(H,31,32)
NCI pathway
Reactome pathway
n/an/a 0.603n/an/an/an/an/an/a
Lanzhou University
Curated by ChEMBL
Assay Description
Inhibition of human VEGFR2 after 60 mins
J Mol Graph Model 27: 642-54 (2008)
Article DOI: 10.1016/j.jmgm.2008.10.006
BindingDB Entry DOI: 10.7270/Q2C24XNX
Vascular endothelial growth factor receptor 2
(Homo sapiens (Human))
BDBM50376038
(CHEMBL412291)
Show SMILES COc1cc2nccc(Oc3ccc4c(cccc4c3)C(=O)Nc3cccc(F)c3)c2cc1OC
Show InChI InChI=1S/C28H21FN2O4/c1-33-26-15-23-24(16-27(26)34-2)30-12-11-25(23)35-20-9-10-21-17(13-20)5-3-8-22(21)28(32)31-19-7-4-6-18(29)14-19/h3-16H,1-2H3,(H,31,32)
NCI pathway
Reactome pathway
n/an/a 0.600n/an/an/an/an/an/a
Amgen Inc.
Curated by ChEMBL
Assay Description
Inhibition of KDR by HTRF assay
J Med Chem 51: 1649-67 (2008)
Article DOI: 10.1021/jm701097z
BindingDB Entry DOI: 10.7270/Q29C6Z8N