BDBM50376042 CHEMBL409512
SMILES: COc1cc2nccc(Oc3ccc4c(cccc4c3)C(=O)Nc3ccc(Cl)cc3)c2cc1C(N)=O
InChI Key: InChIKey=UTUQVVOKHILSBX-UHFFFAOYSA-N
Data: 1 IC50
Activity Spreadsheet -- Enzyme Inhibition Constant Data from BindingDB
Found 1 hit for monomerid = 50376042
Trg + Lig
Ki
nM
ΔG°
kcal/mole
IC50
nM
Kd
nM
EC50/IC50
nM
koff
s-1
kon
M-1s-1
pHTemp
°C
Vascular endothelial growth factor receptor 2
(Homo sapiens (Human))
BDBM50376042
(CHEMBL409512)
Show SMILES COc1cc2nccc(Oc3ccc4c(cccc4c3)C(=O)Nc3ccc(Cl)cc3)c2cc1C(N)=O
Show InChI InChI=1S/C28H20ClN3O4/c1-35-26-15-24-22(14-23(26)27(30)33)25(11-12-31-24)36-19-9-10-20-16(13-19)3-2-4-21(20)28(34)32-18-7-5-17(29)6-8-18/h2-15H,1H3,(H2,30,33)(H,32,34)
NCI pathway
Reactome pathway
n/an/a 0.200n/an/an/an/an/an/a
Amgen Inc.
Curated by ChEMBL
Assay Description
Inhibition of KDR by HTRF assay
J Med Chem 51: 1649-67 (2008)
Article DOI: 10.1021/jm701097z
BindingDB Entry DOI: 10.7270/Q29C6Z8N