BDBM50376113 CHEMBL258631
SMILES: CCC(=O)c1c(-c2ccccc2)c2cc(Cl)ccc2c(=O)n1Cc1cc(C(=O)N(C)C)n(C)n1
InChI Key: InChIKey=AGNSVTMIORSRHI-UHFFFAOYSA-N
Data: 1 IC50
Activity Spreadsheet -- Enzyme Inhibition Constant Data from BindingDB
Found 1 hit for monomerid = 50376113
Trg + Lig
Ki
nM
ΔG°
kcal/mole
IC50
nM
Kd
nM
EC50/IC50
nM
koff
s-1
kon
M-1s-1
pHTemp
°C
Mitogen-activated protein kinase 8
(Homo sapiens (Human))
BDBM50376113
(CHEMBL258631)
Show SMILES CCC(=O)c1c(-c2ccccc2)c2cc(Cl)ccc2c(=O)n1Cc1cc(C(=O)N(C)C)n(C)n1
Show InChI InChI=1S/C26H25ClN4O3/c1-5-22(32)24-23(16-9-7-6-8-10-16)20-13-17(27)11-12-19(20)25(33)31(24)15-18-14-21(30(4)28-18)26(34)29(2)3/h6-14H,5,15H2,1-4H3
NCI pathway
Reactome pathway
n/an/a 11n/an/an/an/an/an/a
Takeda Pharmaceutical Company, Ltd
Curated by ChEMBL
Assay Description
Inhibition of human JNK1 by radiometric assay
Bioorg Med Chem 16: 4699-714 (2008)
Article DOI: 10.1016/j.bmc.2008.02.028
BindingDB Entry DOI: 10.7270/Q2NP2598