null
SMILES: Oc1ccc(\C=C\C(=O)\C=C\c2ccc(O)cc2Br)c(Br)c1
InChI Key: InChIKey=CZOZYYWRRFRQNG-IJIVKGSJSA-N
Activity Spreadsheet -- Enzyme Inhibition Constant Data from BindingDB
Found 1 hit for monomerid = 50376129
Trg + Lig
Ki
nM
ΔG°
kcal/mole
IC50
nM
Kd
nM
EC50/IC50
nM
koff
s-1
kon
M-1s-1
pHTemp
°C
RmtA
(Emericella nidulans)
BDBM50376129
(CHEMBL264683)
Show SMILES Oc1ccc(\C=C\C(=O)\C=C\c2ccc(O)cc2Br)c(Br)c1
Show InChI InChI=1S/C17H12Br2O3/c18-16-9-14(21)7-3-11(16)1-5-13(20)6-2-12-4-8-15(22)10-17(12)19/h1-10,21-22H/b5-1+,6-2+
n/an/a 1.14E+5n/an/an/an/an/an/a
Universit£ degli Studi di Roma La Sapienza
Curated by ChEMBL
Assay Description
Inhibition of Aspergillus nidulans RmtA
J Med Chem 51: 2279-90 (2008)
Article DOI: 10.1021/jm701595q
BindingDB Entry DOI: 10.7270/Q28C9X48