null
SMILES: Oc1ccc(C=CC(=O)CC(=O)C=Cc2ccc(O)c(Br)c2)cc1Br
InChI Key: InChIKey=UHVZSURAKANLBT-UHFFFAOYSA-N
Activity Spreadsheet -- Enzyme Inhibition Constant Data from BindingDB
Found 1 hit for monomerid = 50376143
Trg + Lig
Ki
nM
ΔG°
kcal/mole
IC50
nM
Kd
nM
EC50/IC50
nM
koff
s-1
kon
M-1s-1
pHTemp
°C
RmtA
(Emericella nidulans)
BDBM50376143
(CHEMBL259782)
Show SMILES Oc1ccc(C=CC(=O)CC(=O)C=Cc2ccc(O)c(Br)c2)cc1Br |w:5.4,12.11|
Show InChI InChI=1S/C19H14Br2O4/c20-16-9-12(3-7-18(16)24)1-5-14(22)11-15(23)6-2-13-4-8-19(25)17(21)10-13/h1-10,24-25H,11H2
n/an/a 1.09E+5n/an/an/an/an/an/a
Universit£ degli Studi di Roma La Sapienza
Curated by ChEMBL
Assay Description
Inhibition of Aspergillus nidulans RmtA
J Med Chem 51: 2279-90 (2008)
Article DOI: 10.1021/jm701595q
BindingDB Entry DOI: 10.7270/Q28C9X48