null
SMILES: Oc1c(Br)cc(\C=C\C(=O)c2cccc(c2)C(=O)\C=C\c2cc(Br)c(O)c(Br)c2)cc1Br
InChI Key: InChIKey=YGKNDBKQZUWDHP-YDFGWWAZSA-N
Activity Spreadsheet -- Enzyme Inhibition Constant Data from BindingDB
Found 1 hit for monomerid = 50376145
Trg + Lig
Ki
nM
ΔG°
kcal/mole
IC50
nM
Kd
nM
EC50/IC50
nM
koff
s-1
kon
M-1s-1
pHTemp
°C
RmtA
(Emericella nidulans)
BDBM50376145
(CHEMBL410106)
Show SMILES Oc1c(Br)cc(\C=C\C(=O)c2cccc(c2)C(=O)\C=C\c2cc(Br)c(O)c(Br)c2)cc1Br
Show InChI InChI=1S/C24H14Br4O4/c25-17-8-13(9-18(26)23(17)31)4-6-21(29)15-2-1-3-16(12-15)22(30)7-5-14-10-19(27)24(32)20(28)11-14/h1-12,31-32H/b6-4+,7-5+
n/an/a 1.00E+4n/an/an/an/an/an/a
Universit£ degli Studi di Roma La Sapienza
Curated by ChEMBL
Assay Description
Inhibition of Aspergillus nidulans RmtA
J Med Chem 51: 2279-90 (2008)
Article DOI: 10.1021/jm701595q
BindingDB Entry DOI: 10.7270/Q28C9X48