BDBM50376277 CHEMBL258917
SMILES: CC(C)(C)c1ccc(cc1)C(=O)Nc1cnc2ccccc2c1
InChI Key: InChIKey=MUZWQZALZQTMBA-UHFFFAOYSA-N
Data: 1 KI  1 IC50
Activity Spreadsheet -- Enzyme Inhibition Constant Data from BindingDB
Found 2 hits for monomerid = 50376277
Trg + Lig
Ki
nM
ΔG°
kcal/mole
IC50
nM
Kd
nM
EC50/IC50
nM
koff
s-1
kon
M-1s-1
pHTemp
°C
Transient receptor potential cation channel subfamily V member 1
(Homo sapiens (Human))
BDBM50376277
(CHEMBL258917)
Show SMILES CC(C)(C)c1ccc(cc1)C(=O)Nc1cnc2ccccc2c1
Show InChI InChI=1S/C20H20N2O/c1-20(2,3)16-10-8-14(9-11-16)19(23)22-17-12-15-6-4-5-7-18(15)21-13-17/h4-13H,1-3H3,(H,22,23)
Reactome pathway
24n/an/an/an/an/an/an/an/a
Johnson& Johnson Pharmaceutical Research and Development
Curated by ChEMBL
Assay Description
Displacement of [3H]RTX from human TRPV1 receptor expressed in HEK293 cells
Bioorg Med Chem Lett 18: 2730-4 (2008)
Article DOI: 10.1016/j.bmcl.2008.02.075
BindingDB Entry DOI: 10.7270/Q27H1KF6
Transient receptor potential cation channel subfamily V member 1
(Homo sapiens (Human))
BDBM50376277
(CHEMBL258917)
Show SMILES CC(C)(C)c1ccc(cc1)C(=O)Nc1cnc2ccccc2c1
Show InChI InChI=1S/C20H20N2O/c1-20(2,3)16-10-8-14(9-11-16)19(23)22-17-12-15-6-4-5-7-18(15)21-13-17/h4-13H,1-3H3,(H,22,23)
Reactome pathway
n/an/a 41n/an/an/an/an/an/a
Johnson& Johnson Pharmaceutical Research and Development
Curated by ChEMBL
Assay Description
Activity at human TRPV1 in HEK cells assessed by measuring capsaicin-induced calcium level by FLIPR technology
Bioorg Med Chem Lett 18: 2730-4 (2008)
Article DOI: 10.1016/j.bmcl.2008.02.075
BindingDB Entry DOI: 10.7270/Q27H1KF6